FailedConsole Output

Skipping 291 KB.. Full Log
ping nocloud-kvm instance-data.json on ec2'
test_instance_data_json_lxd (tests.cloud_tests.testcases.modules.snap.TestSnap)
Validate instance-data.json content by lxd platform. ... skipped 'Skipping lxd instance-data.json on ec2'
test_no_stages_errors (tests.cloud_tests.testcases.modules.snap.TestSnap)
Ensure that there were no errors in any stage. ... ok
test_no_warnings_in_log (tests.cloud_tests.testcases.modules.snap.TestSnap)
Unexpected warnings should not be found in the log. ... FAIL
test_snappy_version (tests.cloud_tests.testcases.modules.snap.TestSnap)
Expect hello-world and core snaps are installed. ... ok

======================================================================
FAIL: test_no_warnings_in_log (tests.cloud_tests.testcases.modules.snap.TestSnap)
Unexpected warnings should not be found in the log.
----------------------------------------------------------------------
Traceback (most recent call last):
  File "/var/lib/jenkins/slaves/torkoal/workspace/cloud-init-integration-ec2-x/cloud-init/tests/cloud_tests/testcases/base.py", line 149, in test_no_warnings_in_log
    [], warnings, msg="'WARN' found inside cloud-init.log")
AssertionError: Lists differ: [] != ['2018-06-10 01:11:08,101 - util.py[WARNING]: No active metadata service found']

Second list contains 1 additional elements.
First extra element 0:
'2018-06-10 01:11:08,101 - util.py[WARNING]: No active metadata service found'

- []
+ ['2018-06-10 01:11:08,101 - util.py[WARNING]: No active metadata service found'] : 'WARN' found inside cloud-init.log

----------------------------------------------------------------------
Ran 6 tests in 0.037s

FAILED (failures=1, skipped=2)
2018-06-10 01:25:31,009 - tests.cloud_tests - WARNING - test case: modules/snap failed TestSnap.test_no_warnings_in_log with: + ['2018-06-10 01:11:08,101 - util.py[WARNING]: No active metadata service found'] : 'WARN' found inside cloud-init.log
2018-06-10 01:25:31,009 - tests.cloud_tests - DEBUG - verifying test data for modules/ssh_import_id
test_authorized_keys (tests.cloud_tests.testcases.modules.ssh_import_id.TestSshImportId)
Test that ssh keys were imported. ... ok
test_instance_data_json_ec2 (tests.cloud_tests.testcases.modules.ssh_import_id.TestSshImportId)
Validate instance-data.json content by ec2 platform. ... ok
test_instance_data_json_kvm (tests.cloud_tests.testcases.modules.ssh_import_id.TestSshImportId)
Validate instance-data.json content by nocloud-kvm platform. ... skipped 'Skipping nocloud-kvm instance-data.json on ec2'
test_instance_data_json_lxd (tests.cloud_tests.testcases.modules.ssh_import_id.TestSshImportId)
Validate instance-data.json content by lxd platform. ... skipped 'Skipping lxd instance-data.json on ec2'
test_no_stages_errors (tests.cloud_tests.testcases.modules.ssh_import_id.TestSshImportId)
Ensure that there were no errors in any stage. ... ok
test_no_warnings_in_log (tests.cloud_tests.testcases.modules.ssh_import_id.TestSshImportId)
Unexpected warnings should not be found in the log. ... FAIL

======================================================================
FAIL: test_no_warnings_in_log (tests.cloud_tests.testcases.modules.ssh_import_id.TestSshImportId)
Unexpected warnings should not be found in the log.
----------------------------------------------------------------------
Traceback (most recent call last):
  File "/var/lib/jenkins/slaves/torkoal/workspace/cloud-init-integration-ec2-x/cloud-init/tests/cloud_tests/testcases/base.py", line 149, in test_no_warnings_in_log
    [], warnings, msg="'WARN' found inside cloud-init.log")
AssertionError: Lists differ: [] != ['2018-06-10 01:17:52,552 - util.py[WARNING]: No active metadata service found']

Second list contains 1 additional elements.
First extra element 0:
'2018-06-10 01:17:52,552 - util.py[WARNING]: No active metadata service found'

- []
+ ['2018-06-10 01:17:52,552 - util.py[WARNING]: No active metadata service found'] : 'WARN' found inside cloud-init.log

----------------------------------------------------------------------
Ran 6 tests in 0.037s

FAILED (failures=1, skipped=2)
2018-06-10 01:25:31,054 - tests.cloud_tests - WARNING - test case: modules/ssh_import_id failed TestSshImportId.test_no_warnings_in_log with: + ['2018-06-10 01:17:52,552 - util.py[WARNING]: No active metadata service found'] : 'WARN' found inside cloud-init.log
2018-06-10 01:25:31,055 - tests.cloud_tests - DEBUG - verifying test data for modules/ntp_pools
test_instance_data_json_ec2 (tests.cloud_tests.testcases.modules.ntp_pools.TestNtpPools)
Validate instance-data.json content by ec2 platform. ... ok
test_instance_data_json_kvm (tests.cloud_tests.testcases.modules.ntp_pools.TestNtpPools)
Validate instance-data.json content by nocloud-kvm platform. ... skipped 'Skipping nocloud-kvm instance-data.json on ec2'
test_instance_data_json_lxd (tests.cloud_tests.testcases.modules.ntp_pools.TestNtpPools)
Validate instance-data.json content by lxd platform. ... skipped 'Skipping lxd instance-data.json on ec2'
test_no_stages_errors (tests.cloud_tests.testcases.modules.ntp_pools.TestNtpPools)
Ensure that there were no errors in any stage. ... ok
test_no_warnings_in_log (tests.cloud_tests.testcases.modules.ntp_pools.TestNtpPools)
Unexpected warnings should not be found in the log. ... FAIL
test_ntp_dist_entries (tests.cloud_tests.testcases.modules.ntp_pools.TestNtpPools)
Test dist config file is empty ... ok
test_ntp_entires (tests.cloud_tests.testcases.modules.ntp_pools.TestNtpPools)
Test config entries ... ok
test_ntp_installed (tests.cloud_tests.testcases.modules.ntp_pools.TestNtpPools)
Test ntp installed ... ok
test_ntpq_servers (tests.cloud_tests.testcases.modules.ntp_pools.TestNtpPools)
Test ntpq output has configured servers ... ok

======================================================================
FAIL: test_no_warnings_in_log (tests.cloud_tests.testcases.modules.ntp_pools.TestNtpPools)
Unexpected warnings should not be found in the log.
----------------------------------------------------------------------
Traceback (most recent call last):
  File "/var/lib/jenkins/slaves/torkoal/workspace/cloud-init-integration-ec2-x/cloud-init/tests/cloud_tests/testcases/base.py", line 149, in test_no_warnings_in_log
    [], warnings, msg="'WARN' found inside cloud-init.log")
AssertionError: Lists differ: [] != ['2018-06-10 00:49:33,819 - util.py[WARNING]: No active metadata service found']

Second list contains 1 additional elements.
First extra element 0:
'2018-06-10 00:49:33,819 - util.py[WARNING]: No active metadata service found'

- []
+ ['2018-06-10 00:49:33,819 - util.py[WARNING]: No active metadata service found'] : 'WARN' found inside cloud-init.log

----------------------------------------------------------------------
Ran 9 tests in 0.039s

FAILED (failures=1, skipped=2)
2018-06-10 01:25:31,103 - tests.cloud_tests - WARNING - test case: modules/ntp_pools failed TestNtpPools.test_no_warnings_in_log with: + ['2018-06-10 00:49:33,819 - util.py[WARNING]: No active metadata service found'] : 'WARN' found inside cloud-init.log
2018-06-10 01:25:31,104 - tests.cloud_tests - DEBUG - verifying test data for modules/ssh_keys_generate
test_dsa_private (tests.cloud_tests.testcases.modules.ssh_keys_generate.TestSshKeysGenerate)
Test dsa private key not generated. ... ok
test_dsa_public (tests.cloud_tests.testcases.modules.ssh_keys_generate.TestSshKeysGenerate)
Test dsa public key not generated. ... ok
test_ecdsa_private (tests.cloud_tests.testcases.modules.ssh_keys_generate.TestSshKeysGenerate)
Test ecdsa public key generated. ... ok
test_ecdsa_public (tests.cloud_tests.testcases.modules.ssh_keys_generate.TestSshKeysGenerate)
Test ecdsa public key generated. ... ok
test_ed25519_private (tests.cloud_tests.testcases.modules.ssh_keys_generate.TestSshKeysGenerate)
Test ed25519 public key generated. ... ok
test_ed25519_public (tests.cloud_tests.testcases.modules.ssh_keys_generate.TestSshKeysGenerate)
Test ed25519 public key generated. ... ok
test_instance_data_json_ec2 (tests.cloud_tests.testcases.modules.ssh_keys_generate.TestSshKeysGenerate)
Validate instance-data.json content by ec2 platform. ... ok
test_instance_data_json_kvm (tests.cloud_tests.testcases.modules.ssh_keys_generate.TestSshKeysGenerate)
Validate instance-data.json content by nocloud-kvm platform. ... skipped 'Skipping nocloud-kvm instance-data.json on ec2'
test_instance_data_json_lxd (tests.cloud_tests.testcases.modules.ssh_keys_generate.TestSshKeysGenerate)
Validate instance-data.json content by lxd platform. ... skipped 'Skipping lxd instance-data.json on ec2'
test_no_stages_errors (tests.cloud_tests.testcases.modules.ssh_keys_generate.TestSshKeysGenerate)
Ensure that there were no errors in any stage. ... ok
test_no_warnings_in_log (tests.cloud_tests.testcases.modules.ssh_keys_generate.TestSshKeysGenerate)
Unexpected warnings should not be found in the log. ... FAIL
test_rsa_private (tests.cloud_tests.testcases.modules.ssh_keys_generate.TestSshKeysGenerate)
Test rsa public key not generated. ... ok
test_rsa_public (tests.cloud_tests.testcases.modules.ssh_keys_generate.TestSshKeysGenerate)
Test rsa public key not generated. ... ok

======================================================================
FAIL: test_no_warnings_in_log (tests.cloud_tests.testcases.modules.ssh_keys_generate.TestSshKeysGenerate)
Unexpected warnings should not be found in the log.
----------------------------------------------------------------------
Traceback (most recent call last):
  File "/var/lib/jenkins/slaves/torkoal/workspace/cloud-init-integration-ec2-x/cloud-init/tests/cloud_tests/testcases/base.py", line 149, in test_no_warnings_in_log
    [], warnings, msg="'WARN' found inside cloud-init.log")
AssertionError: Lists differ: [] != ['2018-06-10 01:19:25,690 - util.py[WARNING]: No active metadata service found']

Second list contains 1 additional elements.
First extra element 0:
'2018-06-10 01:19:25,690 - util.py[WARNING]: No active metadata service found'

- []
+ ['2018-06-10 01:19:25,690 - util.py[WARNING]: No active metadata service found'] : 'WARN' found inside cloud-init.log

----------------------------------------------------------------------
Ran 13 tests in 0.074s

FAILED (failures=1, skipped=2)
2018-06-10 01:25:31,190 - tests.cloud_tests - WARNING - test case: modules/ssh_keys_generate failed TestSshKeysGenerate.test_no_warnings_in_log with: + ['2018-06-10 01:19:25,690 - util.py[WARNING]: No active metadata service found'] : 'WARN' found inside cloud-init.log
2018-06-10 01:25:31,190 - tests.cloud_tests - DEBUG - verifying test data for modules/ssh_auth_key_fingerprints_enable
test_instance_data_json_ec2 (tests.cloud_tests.testcases.modules.ssh_auth_key_fingerprints_enable.TestSshKeyFingerprintsEnable)
Validate instance-data.json content by ec2 platform. ... ok
test_instance_data_json_kvm (tests.cloud_tests.testcases.modules.ssh_auth_key_fingerprints_enable.TestSshKeyFingerprintsEnable)
Validate instance-data.json content by nocloud-kvm platform. ... skipped 'Skipping nocloud-kvm instance-data.json on ec2'
test_instance_data_json_lxd (tests.cloud_tests.testcases.modules.ssh_auth_key_fingerprints_enable.TestSshKeyFingerprintsEnable)
Validate instance-data.json content by lxd platform. ... skipped 'Skipping lxd instance-data.json on ec2'
test_no_stages_errors (tests.cloud_tests.testcases.modules.ssh_auth_key_fingerprints_enable.TestSshKeyFingerprintsEnable)
Ensure that there were no errors in any stage. ... ok
test_no_warnings_in_log (tests.cloud_tests.testcases.modules.ssh_auth_key_fingerprints_enable.TestSshKeyFingerprintsEnable)
Unexpected warnings should not be found in the log. ... FAIL
test_syslog (tests.cloud_tests.testcases.modules.ssh_auth_key_fingerprints_enable.TestSshKeyFingerprintsEnable)
Verify output of syslog. ... ok

======================================================================
FAIL: test_no_warnings_in_log (tests.cloud_tests.testcases.modules.ssh_auth_key_fingerprints_enable.TestSshKeyFingerprintsEnable)
Unexpected warnings should not be found in the log.
----------------------------------------------------------------------
Traceback (most recent call last):
  File "/var/lib/jenkins/slaves/torkoal/workspace/cloud-init-integration-ec2-x/cloud-init/tests/cloud_tests/testcases/base.py", line 149, in test_no_warnings_in_log
    [], warnings, msg="'WARN' found inside cloud-init.log")
AssertionError: Lists differ: [] != ['2018-06-10 01:16:16,907 - util.py[WARNING]: No active metadata service found']

Second list contains 1 additional elements.
First extra element 0:
'2018-06-10 01:16:16,907 - util.py[WARNING]: No active metadata service found'

- []
+ ['2018-06-10 01:16:16,907 - util.py[WARNING]: No active metadata service found'] : 'WARN' found inside cloud-init.log

----------------------------------------------------------------------
Ran 6 tests in 0.038s

FAILED (failures=1, skipped=2)
2018-06-10 01:25:31,238 - tests.cloud_tests - WARNING - test case: modules/ssh_auth_key_fingerprints_enable failed TestSshKeyFingerprintsEnable.test_no_warnings_in_log with: + ['2018-06-10 01:16:16,907 - util.py[WARNING]: No active metadata service found'] : 'WARN' found inside cloud-init.log
2018-06-10 01:25:31,239 - tests.cloud_tests - DEBUG - verifying test data for modules/apt_configure_sources_keyserver
test_apt_key_list (tests.cloud_tests.testcases.modules.apt_configure_sources_keyserver.TestAptconfigureSourcesKeyserver)
Test specific key added. ... ok
test_instance_data_json_ec2 (tests.cloud_tests.testcases.modules.apt_configure_sources_keyserver.TestAptconfigureSourcesKeyserver)
Validate instance-data.json content by ec2 platform. ... ok
test_instance_data_json_kvm (tests.cloud_tests.testcases.modules.apt_configure_sources_keyserver.TestAptconfigureSourcesKeyserver)
Validate instance-data.json content by nocloud-kvm platform. ... skipped 'Skipping nocloud-kvm instance-data.json on ec2'
test_instance_data_json_lxd (tests.cloud_tests.testcases.modules.apt_configure_sources_keyserver.TestAptconfigureSourcesKeyserver)
Validate instance-data.json content by lxd platform. ... skipped 'Skipping lxd instance-data.json on ec2'
test_no_stages_errors (tests.cloud_tests.testcases.modules.apt_configure_sources_keyserver.TestAptconfigureSourcesKeyserver)
Ensure that there were no errors in any stage. ... ok
test_no_warnings_in_log (tests.cloud_tests.testcases.modules.apt_configure_sources_keyserver.TestAptconfigureSourcesKeyserver)
Unexpected warnings should not be found in the log. ... FAIL
test_source_list (tests.cloud_tests.testcases.modules.apt_configure_sources_keyserver.TestAptconfigureSourcesKeyserver)
Test source.list updated. ... ok

======================================================================
FAIL: test_no_warnings_in_log (tests.cloud_tests.testcases.modules.apt_configure_sources_keyserver.TestAptconfigureSourcesKeyserver)
Unexpected warnings should not be found in the log.
----------------------------------------------------------------------
Traceback (most recent call last):
  File "/var/lib/jenkins/slaves/torkoal/workspace/cloud-init-integration-ec2-x/cloud-init/tests/cloud_tests/testcases/base.py", line 149, in test_no_warnings_in_log
    [], warnings, msg="'WARN' found inside cloud-init.log")
AssertionError: Lists differ: [] != ['2018-06-10 00:21:52,774 - util.py[WARNING]: No active metadata service found']

Second list contains 1 additional elements.
First extra element 0:
'2018-06-10 00:21:52,774 - util.py[WARNING]: No active metadata service found'

- []
+ ['2018-06-10 00:21:52,774 - util.py[WARNING]: No active metadata service found'] : 'WARN' found inside cloud-init.log

----------------------------------------------------------------------
Ran 7 tests in 0.038s

FAILED (failures=1, skipped=2)
2018-06-10 01:25:31,285 - tests.cloud_tests - WARNING - test case: modules/apt_configure_sources_keyserver failed TestAptconfigureSourcesKeyserver.test_no_warnings_in_log with: + ['2018-06-10 00:21:52,774 - util.py[WARNING]: No active metadata service found'] : 'WARN' found inside cloud-init.log
2018-06-10 01:25:31,285 - tests.cloud_tests - DEBUG - verifying test data for modules/bootcmd
test_bootcmd_host (tests.cloud_tests.testcases.modules.bootcmd.TestBootCmd)
Test boot cmd worked. ... ok
test_instance_data_json_ec2 (tests.cloud_tests.testcases.modules.bootcmd.TestBootCmd)
Validate instance-data.json content by ec2 platform. ... ok
test_instance_data_json_kvm (tests.cloud_tests.testcases.modules.bootcmd.TestBootCmd)
Validate instance-data.json content by nocloud-kvm platform. ... skipped 'Skipping nocloud-kvm instance-data.json on ec2'
test_instance_data_json_lxd (tests.cloud_tests.testcases.modules.bootcmd.TestBootCmd)
Validate instance-data.json content by lxd platform. ... skipped 'Skipping lxd instance-data.json on ec2'
test_no_stages_errors (tests.cloud_tests.testcases.modules.bootcmd.TestBootCmd)
Ensure that there were no errors in any stage. ... ok
test_no_warnings_in_log (tests.cloud_tests.testcases.modules.bootcmd.TestBootCmd)
Unexpected warnings should not be found in the log. ... FAIL

======================================================================
FAIL: test_no_warnings_in_log (tests.cloud_tests.testcases.modules.bootcmd.TestBootCmd)
Unexpected warnings should not be found in the log.
----------------------------------------------------------------------
Traceback (most recent call last):
  File "/var/lib/jenkins/slaves/torkoal/workspace/cloud-init-integration-ec2-x/cloud-init/tests/cloud_tests/testcases/base.py", line 149, in test_no_warnings_in_log
    [], warnings, msg="'WARN' found inside cloud-init.log")
AssertionError: Lists differ: [] != ['2018-06-10 00:30:14,788 - util.py[WARNING]: No active metadata service found']

Second list contains 1 additional elements.
First extra element 0:
'2018-06-10 00:30:14,788 - util.py[WARNING]: No active metadata service found'

- []
+ ['2018-06-10 00:30:14,788 - util.py[WARNING]: No active metadata service found'] : 'WARN' found inside cloud-init.log

----------------------------------------------------------------------
Ran 6 tests in 0.037s

FAILED (failures=1, skipped=2)
2018-06-10 01:25:31,330 - tests.cloud_tests - WARNING - test case: modules/bootcmd failed TestBootCmd.test_no_warnings_in_log with: + ['2018-06-10 00:30:14,788 - util.py[WARNING]: No active metadata service found'] : 'WARN' found inside cloud-init.log
2018-06-10 01:25:31,330 - tests.cloud_tests - DEBUG - verifying test data for modules/set_hostname_fqdn
test_hostname (tests.cloud_tests.testcases.modules.set_hostname_fqdn.TestHostnameFqdn)
Test hostname output. ... ok
test_hostname_fqdn (tests.cloud_tests.testcases.modules.set_hostname_fqdn.TestHostnameFqdn)
Test hostname fqdn output. ... ok
test_hosts (tests.cloud_tests.testcases.modules.set_hostname_fqdn.TestHostnameFqdn)
Test /etc/hosts file. ... ok
test_instance_data_json_ec2 (tests.cloud_tests.testcases.modules.set_hostname_fqdn.TestHostnameFqdn)
Validate instance-data.json content by ec2 platform. ... ok
test_instance_data_json_kvm (tests.cloud_tests.testcases.modules.set_hostname_fqdn.TestHostnameFqdn)
Validate instance-data.json content by nocloud-kvm platform. ... skipped 'Skipping nocloud-kvm instance-data.json on ec2'
test_instance_data_json_lxd (tests.cloud_tests.testcases.modules.set_hostname_fqdn.TestHostnameFqdn)
Validate instance-data.json content by lxd platform. ... skipped 'Skipping lxd instance-data.json on ec2'
test_no_stages_errors (tests.cloud_tests.testcases.modules.set_hostname_fqdn.TestHostnameFqdn)
Ensure that there were no errors in any stage. ... ok
test_no_warnings_in_log (tests.cloud_tests.testcases.modules.set_hostname_fqdn.TestHostnameFqdn)
Unexpected warnings should not be found in the log. ... FAIL

======================================================================
FAIL: test_no_warnings_in_log (tests.cloud_tests.testcases.modules.set_hostname_fqdn.TestHostnameFqdn)
Unexpected warnings should not be found in the log.
----------------------------------------------------------------------
Traceback (most recent call last):
  File "/var/lib/jenkins/slaves/torkoal/workspace/cloud-init-integration-ec2-x/cloud-init/tests/cloud_tests/testcases/base.py", line 149, in test_no_warnings_in_log
    [], warnings, msg="'WARN' found inside cloud-init.log")
AssertionError: Lists differ: [] != ['2018-06-10 01:03:13,995 - util.py[WARNING]: No active metadata service found']

Second list contains 1 additional elements.
First extra element 0:
'2018-06-10 01:03:13,995 - util.py[WARNING]: No active metadata service found'

- []
+ ['2018-06-10 01:03:13,995 - util.py[WARNING]: No active metadata service found'] : 'WARN' found inside cloud-init.log

----------------------------------------------------------------------
Ran 8 tests in 0.038s

FAILED (failures=1, skipped=2)
2018-06-10 01:25:31,377 - tests.cloud_tests - WARNING - test case: modules/set_hostname_fqdn failed TestHostnameFqdn.test_no_warnings_in_log with: + ['2018-06-10 01:03:13,995 - util.py[WARNING]: No active metadata service found'] : 'WARN' found inside cloud-init.log
2018-06-10 01:25:31,377 - tests.cloud_tests - DEBUG - verifying test data for modules/ssh_auth_key_fingerprints_disable
test_cloud_init_log (tests.cloud_tests.testcases.modules.ssh_auth_key_fingerprints_disable.TestSshKeyFingerprintsDisable)
Verify disabled. ... ok
test_instance_data_json_ec2 (tests.cloud_tests.testcases.modules.ssh_auth_key_fingerprints_disable.TestSshKeyFingerprintsDisable)
Validate instance-data.json content by ec2 platform. ... ok
test_instance_data_json_kvm (tests.cloud_tests.testcases.modules.ssh_auth_key_fingerprints_disable.TestSshKeyFingerprintsDisable)
Validate instance-data.json content by nocloud-kvm platform. ... skipped 'Skipping nocloud-kvm instance-data.json on ec2'
test_instance_data_json_lxd (tests.cloud_tests.testcases.modules.ssh_auth_key_fingerprints_disable.TestSshKeyFingerprintsDisable)
Validate instance-data.json content by lxd platform. ... skipped 'Skipping lxd instance-data.json on ec2'
test_no_stages_errors (tests.cloud_tests.testcases.modules.ssh_auth_key_fingerprints_disable.TestSshKeyFingerprintsDisable)
Ensure that there were no errors in any stage. ... ok
test_no_warnings_in_log (tests.cloud_tests.testcases.modules.ssh_auth_key_fingerprints_disable.TestSshKeyFingerprintsDisable)
Unexpected warnings should not be found in the log. ... FAIL

======================================================================
FAIL: test_no_warnings_in_log (tests.cloud_tests.testcases.modules.ssh_auth_key_fingerprints_disable.TestSshKeyFingerprintsDisable)
Unexpected warnings should not be found in the log.
----------------------------------------------------------------------
Traceback (most recent call last):
  File "/var/lib/jenkins/slaves/torkoal/workspace/cloud-init-integration-ec2-x/cloud-init/tests/cloud_tests/testcases/base.py", line 149, in test_no_warnings_in_log
    [], warnings, msg="'WARN' found inside cloud-init.log")
AssertionError: Lists differ: [] != ['2018-06-10 01:14:40,090 - util.py[WARNING]: No active metadata service found']

Second list contains 1 additional elements.
First extra element 0:
'2018-06-10 01:14:40,090 - util.py[WARNING]: No active metadata service found'

- []
+ ['2018-06-10 01:14:40,090 - util.py[WARNING]: No active metadata service found'] : 'WARN' found inside cloud-init.log

----------------------------------------------------------------------
Ran 6 tests in 0.037s

FAILED (failures=1, skipped=2)
2018-06-10 01:25:31,422 - tests.cloud_tests - WARNING - test case: modules/ssh_auth_key_fingerprints_disable failed TestSshKeyFingerprintsDisable.test_no_warnings_in_log with: + ['2018-06-10 01:14:40,090 - util.py[WARNING]: No active metadata service found'] : 'WARN' found inside cloud-init.log
2018-06-10 01:25:31,422 - tests.cloud_tests - DEBUG - verifying test data for modules/final_message
test_final_message_string (tests.cloud_tests.testcases.modules.final_message.TestFinalMessage)
Ensure final handles regular strings. ... ok
test_final_message_subs (tests.cloud_tests.testcases.modules.final_message.TestFinalMessage)
Test variable substitution in final message. ... ok
test_instance_data_json_ec2 (tests.cloud_tests.testcases.modules.final_message.TestFinalMessage)
Validate instance-data.json content by ec2 platform. ... ok
test_instance_data_json_kvm (tests.cloud_tests.testcases.modules.final_message.TestFinalMessage)
Validate instance-data.json content by nocloud-kvm platform. ... skipped 'Skipping nocloud-kvm instance-data.json on ec2'
test_instance_data_json_lxd (tests.cloud_tests.testcases.modules.final_message.TestFinalMessage)
Validate instance-data.json content by lxd platform. ... skipped 'Skipping lxd instance-data.json on ec2'
test_no_stages_errors (tests.cloud_tests.testcases.modules.final_message.TestFinalMessage)
Ensure that there were no errors in any stage. ... ok
test_no_warnings_in_log (tests.cloud_tests.testcases.modules.final_message.TestFinalMessage)
Unexpected warnings should not be found in the log. ... FAIL

======================================================================
FAIL: test_no_warnings_in_log (tests.cloud_tests.testcases.modules.final_message.TestFinalMessage)
Unexpected warnings should not be found in the log.
----------------------------------------------------------------------
Traceback (most recent call last):
  File "/var/lib/jenkins/slaves/torkoal/workspace/cloud-init-integration-ec2-x/cloud-init/tests/cloud_tests/testcases/base.py", line 149, in test_no_warnings_in_log
    [], warnings, msg="'WARN' found inside cloud-init.log")
AssertionError: Lists differ: [] != ['2018-06-10 00:37:40,860 - util.py[WARNING]: No active metadata service found']

Second list contains 1 additional elements.
First extra element 0:
'2018-06-10 00:37:40,860 - util.py[WARNING]: No active metadata service found'

- []
+ ['2018-06-10 00:37:40,860 - util.py[WARNING]: No active metadata service found'] : 'WARN' found inside cloud-init.log

----------------------------------------------------------------------
Ran 7 tests in 0.038s

FAILED (failures=1, skipped=2)
2018-06-10 01:25:31,468 - tests.cloud_tests - WARNING - test case: modules/final_message failed TestFinalMessage.test_no_warnings_in_log with: + ['2018-06-10 00:37:40,860 - util.py[WARNING]: No active metadata service found'] : 'WARN' found inside cloud-init.log
2018-06-10 01:25:31,468 - tests.cloud_tests - DEBUG - verifying test data for modules/apt_configure_sources_key
test_apt_key_list (tests.cloud_tests.testcases.modules.apt_configure_sources_key.TestAptconfigureSourcesKey)
Test key list updated. ... ok
test_instance_data_json_ec2 (tests.cloud_tests.testcases.modules.apt_configure_sources_key.TestAptconfigureSourcesKey)
Validate instance-data.json content by ec2 platform. ... ok
test_instance_data_json_kvm (tests.cloud_tests.testcases.modules.apt_configure_sources_key.TestAptconfigureSourcesKey)
Validate instance-data.json content by nocloud-kvm platform. ... skipped 'Skipping nocloud-kvm instance-data.json on ec2'
test_instance_data_json_lxd (tests.cloud_tests.testcases.modules.apt_configure_sources_key.TestAptconfigureSourcesKey)
Validate instance-data.json content by lxd platform. ... skipped 'Skipping lxd instance-data.json on ec2'
test_no_stages_errors (tests.cloud_tests.testcases.modules.apt_configure_sources_key.TestAptconfigureSourcesKey)
Ensure that there were no errors in any stage. ... ok
test_no_warnings_in_log (tests.cloud_tests.testcases.modules.apt_configure_sources_key.TestAptconfigureSourcesKey)
Unexpected warnings should not be found in the log. ... FAIL
test_source_list (tests.cloud_tests.testcases.modules.apt_configure_sources_key.TestAptconfigureSourcesKey)
Test source.list updated. ... ok

======================================================================
FAIL: test_no_warnings_in_log (tests.cloud_tests.testcases.modules.apt_configure_sources_key.TestAptconfigureSourcesKey)
Unexpected warnings should not be found in the log.
----------------------------------------------------------------------
Traceback (most recent call last):
  File "/var/lib/jenkins/slaves/torkoal/workspace/cloud-init-integration-ec2-x/cloud-init/tests/cloud_tests/testcases/base.py", line 149, in test_no_warnings_in_log
    [], warnings, msg="'WARN' found inside cloud-init.log")
AssertionError: Lists differ: [] != ['2018-06-10 00:20:10,289 - util.py[WARNING]: No active metadata service found']

Second list contains 1 additional elements.
First extra element 0:
'2018-06-10 00:20:10,289 - util.py[WARNING]: No active metadata service found'

- []
+ ['2018-06-10 00:20:10,289 - util.py[WARNING]: No active metadata service found'] : 'WARN' found inside cloud-init.log

----------------------------------------------------------------------
Ran 7 tests in 0.038s

FAILED (failures=1, skipped=2)
2018-06-10 01:25:31,516 - tests.cloud_tests - WARNING - test case: modules/apt_configure_sources_key failed TestAptconfigureSourcesKey.test_no_warnings_in_log with: + ['2018-06-10 00:20:10,289 - util.py[WARNING]: No active metadata service found'] : 'WARN' found inside cloud-init.log
2018-06-10 01:25:31,517 - tests.cloud_tests - DEBUG - verifying test data for modules/ntp_servers
test_instance_data_json_ec2 (tests.cloud_tests.testcases.modules.ntp_servers.TestNtpServers)
Validate instance-data.json content by ec2 platform. ... ok
test_instance_data_json_kvm (tests.cloud_tests.testcases.modules.ntp_servers.TestNtpServers)
Validate instance-data.json content by nocloud-kvm platform. ... skipped 'Skipping nocloud-kvm instance-data.json on ec2'
test_instance_data_json_lxd (tests.cloud_tests.testcases.modules.ntp_servers.TestNtpServers)
Validate instance-data.json content by lxd platform. ... skipped 'Skipping lxd instance-data.json on ec2'
test_no_stages_errors (tests.cloud_tests.testcases.modules.ntp_servers.TestNtpServers)
Ensure that there were no errors in any stage. ... ok
test_no_warnings_in_log (tests.cloud_tests.testcases.modules.ntp_servers.TestNtpServers)
Unexpected warnings should not be found in the log. ... FAIL
test_ntp_dist_entries (tests.cloud_tests.testcases.modules.ntp_servers.TestNtpServers)
Test dist config file is empty ... ok
test_ntp_entries (tests.cloud_tests.testcases.modules.ntp_servers.TestNtpServers)
Test config server entries ... ok
test_ntp_installed (tests.cloud_tests.testcases.modules.ntp_servers.TestNtpServers)
Test ntp installed ... ok
test_ntpq_servers (tests.cloud_tests.testcases.modules.ntp_servers.TestNtpServers)
Test ntpq output has configured servers ... ok

======================================================================
FAIL: test_no_warnings_in_log (tests.cloud_tests.testcases.modules.ntp_servers.TestNtpServers)
Unexpected warnings should not be found in the log.
----------------------------------------------------------------------
Traceback (most recent call last):
  File "/var/lib/jenkins/slaves/torkoal/workspace/cloud-init-integration-ec2-x/cloud-init/tests/cloud_tests/testcases/base.py", line 149, in test_no_warnings_in_log
    [], warnings, msg="'WARN' found inside cloud-init.log")
AssertionError: Lists differ: [] != ['2018-06-10 00:51:20,106 - util.py[WARNING]: No active metadata service found']

Second list contains 1 additional elements.
First extra element 0:
'2018-06-10 00:51:20,106 - util.py[WARNING]: No active metadata service found'

- []
+ ['2018-06-10 00:51:20,106 - util.py[WARNING]: No active metadata service found'] : 'WARN' found inside cloud-init.log

----------------------------------------------------------------------
Ran 9 tests in 0.042s

FAILED (failures=1, skipped=2)
2018-06-10 01:25:31,568 - tests.cloud_tests - WARNING - test case: modules/ntp_servers failed TestNtpServers.test_no_warnings_in_log with: + ['2018-06-10 00:51:20,106 - util.py[WARNING]: No active metadata service found'] : 'WARN' found inside cloud-init.log
2018-06-10 01:25:31,568 - tests.cloud_tests - DEBUG - verifying test data for modules/snappy
test_instance_data_json_ec2 (tests.cloud_tests.testcases.modules.snappy.TestSnappy)
Validate instance-data.json content by ec2 platform. ... ok
test_instance_data_json_kvm (tests.cloud_tests.testcases.modules.snappy.TestSnappy)
Validate instance-data.json content by nocloud-kvm platform. ... skipped 'Skipping nocloud-kvm instance-data.json on ec2'
test_instance_data_json_lxd (tests.cloud_tests.testcases.modules.snappy.TestSnappy)
Validate instance-data.json content by lxd platform. ... skipped 'Skipping lxd instance-data.json on ec2'
test_no_stages_errors (tests.cloud_tests.testcases.modules.snappy.TestSnappy)
Ensure that there were no errors in any stage. ... ok
test_no_warnings_in_log (tests.cloud_tests.testcases.modules.snappy.TestSnappy)
Unexpected warnings should not be found in the log. ... FAIL
test_snappy_version (tests.cloud_tests.testcases.modules.snappy.TestSnappy)
Test snappy version output ... ok

======================================================================
FAIL: test_no_warnings_in_log (tests.cloud_tests.testcases.modules.snappy.TestSnappy)
Unexpected warnings should not be found in the log.
----------------------------------------------------------------------
Traceback (most recent call last):
  File "/var/lib/jenkins/slaves/torkoal/workspace/cloud-init-integration-ec2-x/cloud-init/tests/cloud_tests/testcases/base.py", line 149, in test_no_warnings_in_log
    [], warnings, msg="'WARN' found inside cloud-init.log")
AssertionError: Lists differ: [] != ['2018-06-10 01:13:01,974 - util.py[WARNING]: No active metadata service found']

Second list contains 1 additional elements.
First extra element 0:
'2018-06-10 01:13:01,974 - util.py[WARNING]: No active metadata service found'

- []
+ ['2018-06-10 01:13:01,974 - util.py[WARNING]: No active metadata service found'] : 'WARN' found inside cloud-init.log

----------------------------------------------------------------------
Ran 6 tests in 0.061s

FAILED (failures=1, skipped=2)
2018-06-10 01:25:31,642 - tests.cloud_tests - WARNING - test case: modules/snappy failed TestSnappy.test_no_warnings_in_log with: + ['2018-06-10 01:13:01,974 - util.py[WARNING]: No active metadata service found'] : 'WARN' found inside cloud-init.log
2018-06-10 01:25:31,642 - tests.cloud_tests - DEBUG - verifying test data for modules/ntp_chrony
test_chrony_entires (tests.cloud_tests.testcases.modules.ntp_chrony.TestNtpChrony)
Test chrony config entries ... ok
test_instance_data_json_ec2 (tests.cloud_tests.testcases.modules.ntp_chrony.TestNtpChrony)
Validate instance-data.json content by ec2 platform. ... ok
test_instance_data_json_kvm (tests.cloud_tests.testcases.modules.ntp_chrony.TestNtpChrony)
Validate instance-data.json content by nocloud-kvm platform. ... skipped 'Skipping nocloud-kvm instance-data.json on ec2'
test_instance_data_json_lxd (tests.cloud_tests.testcases.modules.ntp_chrony.TestNtpChrony)
Validate instance-data.json content by lxd platform. ... skipped 'Skipping lxd instance-data.json on ec2'
test_no_stages_errors (tests.cloud_tests.testcases.modules.ntp_chrony.TestNtpChrony)
Ensure that there were no errors in any stage. ... ok
test_no_warnings_in_log (tests.cloud_tests.testcases.modules.ntp_chrony.TestNtpChrony)
Unexpected warnings should not be found in the log. ... FAIL

======================================================================
FAIL: test_no_warnings_in_log (tests.cloud_tests.testcases.modules.ntp_chrony.TestNtpChrony)
Unexpected warnings should not be found in the log.
----------------------------------------------------------------------
Traceback (most recent call last):
  File "/var/lib/jenkins/slaves/torkoal/workspace/cloud-init-integration-ec2-x/cloud-init/tests/cloud_tests/testcases/base.py", line 149, in test_no_warnings_in_log
    [], warnings, msg="'WARN' found inside cloud-init.log")
AssertionError: Lists differ: [] != ['2018-06-10 00:47:40,441 - util.py[WARNING]: No active metadata service found']

Second list contains 1 additional elements.
First extra element 0:
'2018-06-10 00:47:40,441 - util.py[WARNING]: No active metadata service found'

- []
+ ['2018-06-10 00:47:40,441 - util.py[WARNING]: No active metadata service found'] : 'WARN' found inside cloud-init.log

----------------------------------------------------------------------
Ran 6 tests in 0.037s

FAILED (failures=1, skipped=2)
2018-06-10 01:25:31,687 - tests.cloud_tests - WARNING - test case: modules/ntp_chrony failed TestNtpChrony.test_no_warnings_in_log with: + ['2018-06-10 00:47:40,441 - util.py[WARNING]: No active metadata service found'] : 'WARN' found inside cloud-init.log
2018-06-10 01:25:31,687 - tests.cloud_tests - DEBUG - verifying test data for modules/write_files
test_b64 (tests.cloud_tests.testcases.modules.write_files.TestWriteFiles)
Test b64 encoded file reads as ascii. ... ok
test_binary (tests.cloud_tests.testcases.modules.write_files.TestWriteFiles)
Test binary file reads as executable. ... ok
test_gzip (tests.cloud_tests.testcases.modules.write_files.TestWriteFiles)
Test gzip file shows up as a shell script. ... ok
test_instance_data_json_ec2 (tests.cloud_tests.testcases.modules.write_files.TestWriteFiles)
Validate instance-data.json content by ec2 platform. ... ok
test_instance_data_json_kvm (tests.cloud_tests.testcases.modules.write_files.TestWriteFiles)
Validate instance-data.json content by nocloud-kvm platform. ... skipped 'Skipping nocloud-kvm instance-data.json on ec2'
test_instance_data_json_lxd (tests.cloud_tests.testcases.modules.write_files.TestWriteFiles)
Validate instance-data.json content by lxd platform. ... skipped 'Skipping lxd instance-data.json on ec2'
test_no_stages_errors (tests.cloud_tests.testcases.modules.write_files.TestWriteFiles)
Ensure that there were no errors in any stage. ... ok
test_no_warnings_in_log (tests.cloud_tests.testcases.modules.write_files.TestWriteFiles)
Unexpected warnings should not be found in the log. ... FAIL
test_text (tests.cloud_tests.testcases.modules.write_files.TestWriteFiles)
Test text shows up as ASCII text. ... ok

======================================================================
FAIL: test_no_warnings_in_log (tests.cloud_tests.testcases.modules.write_files.TestWriteFiles)
Unexpected warnings should not be found in the log.
----------------------------------------------------------------------
Traceback (most recent call last):
  File "/var/lib/jenkins/slaves/torkoal/workspace/cloud-init-integration-ec2-x/cloud-init/tests/cloud_tests/testcases/base.py", line 149, in test_no_warnings_in_log
    [], warnings, msg="'WARN' found inside cloud-init.log")
AssertionError: Lists differ: [] != ['2018-06-10 01:24:01,540 - util.py[WARNING]: No active metadata service found']

Second list contains 1 additional elements.
First extra element 0:
'2018-06-10 01:24:01,540 - util.py[WARNING]: No active metadata service found'

- []
+ ['2018-06-10 01:24:01,540 - util.py[WARNING]: No active metadata service found'] : 'WARN' found inside cloud-init.log

----------------------------------------------------------------------
Ran 9 tests in 0.037s

FAILED (failures=1, skipped=2)
2018-06-10 01:25:31,733 - tests.cloud_tests - WARNING - test case: modules/write_files failed TestWriteFiles.test_no_warnings_in_log with: + ['2018-06-10 01:24:01,540 - util.py[WARNING]: No active metadata service found'] : 'WARN' found inside cloud-init.log
2018-06-10 01:25:31,734 - tests.cloud_tests - DEBUG - verifying test data for modules/set_password
test_instance_data_json_ec2 (tests.cloud_tests.testcases.modules.set_password.TestPassword)
Validate instance-data.json content by ec2 platform. ... ok
test_instance_data_json_kvm (tests.cloud_tests.testcases.modules.set_password.TestPassword)
Validate instance-data.json content by nocloud-kvm platform. ... skipped 'Skipping nocloud-kvm instance-data.json on ec2'
test_instance_data_json_lxd (tests.cloud_tests.testcases.modules.set_password.TestPassword)
Validate instance-data.json content by lxd platform. ... skipped 'Skipping lxd instance-data.json on ec2'
test_no_stages_errors (tests.cloud_tests.testcases.modules.set_password.TestPassword)
Ensure that there were no errors in any stage. ... ok
test_no_warnings_in_log (tests.cloud_tests.testcases.modules.set_password.TestPassword)
Unexpected warnings should not be found in the log. ... FAIL
test_shadow (tests.cloud_tests.testcases.modules.set_password.TestPassword)
Test ubuntu user in shadow. ... ok
test_sshd_config (tests.cloud_tests.testcases.modules.set_password.TestPassword)
Test sshd config allows passwords. ... ok

======================================================================
FAIL: test_no_warnings_in_log (tests.cloud_tests.testcases.modules.set_password.TestPassword)
Unexpected warnings should not be found in the log.
----------------------------------------------------------------------
Traceback (most recent call last):
  File "/var/lib/jenkins/slaves/torkoal/workspace/cloud-init-integration-ec2-x/cloud-init/tests/cloud_tests/testcases/base.py", line 149, in test_no_warnings_in_log
    [], warnings, msg="'WARN' found inside cloud-init.log")
AssertionError: Lists differ: [] != ['2018-06-10 01:04:35,932 - util.py[WARNING]: No active metadata service found']

Second list contains 1 additional elements.
First extra element 0:
'2018-06-10 01:04:35,932 - util.py[WARNING]: No active metadata service found'

- []
+ ['2018-06-10 01:04:35,932 - util.py[WARNING]: No active metadata service found'] : 'WARN' found inside cloud-init.log

----------------------------------------------------------------------
Ran 7 tests in 0.037s

FAILED (failures=1, skipped=2)
2018-06-10 01:25:31,779 - tests.cloud_tests - WARNING - test case: modules/set_password failed TestPassword.test_no_warnings_in_log with: + ['2018-06-10 01:04:35,932 - util.py[WARNING]: No active metadata service found'] : 'WARN' found inside cloud-init.log
2018-06-10 01:25:31,779 - tests.cloud_tests - DEBUG - verifying test data for modules/ntp
test_instance_data_json_ec2 (tests.cloud_tests.testcases.modules.ntp.TestNtp)
Validate instance-data.json content by ec2 platform. ... ok
test_instance_data_json_kvm (tests.cloud_tests.testcases.modules.ntp.TestNtp)
Validate instance-data.json content by nocloud-kvm platform. ... skipped 'Skipping nocloud-kvm instance-data.json on ec2'
test_instance_data_json_lxd (tests.cloud_tests.testcases.modules.ntp.TestNtp)
Validate instance-data.json content by lxd platform. ... skipped 'Skipping lxd instance-data.json on ec2'
test_no_stages_errors (tests.cloud_tests.testcases.modules.ntp.TestNtp)
Ensure that there were no errors in any stage. ... ok
test_no_warnings_in_log (tests.cloud_tests.testcases.modules.ntp.TestNtp)
Unexpected warnings should not be found in the log. ... FAIL
test_ntp_dist_entries (tests.cloud_tests.testcases.modules.ntp.TestNtp)
Test dist config file is empty ... ok
test_ntp_entries (tests.cloud_tests.testcases.modules.ntp.TestNtp)
Test config entries ... ok
test_ntp_installed (tests.cloud_tests.testcases.modules.ntp.TestNtp)
Test ntp installed ... ok

======================================================================
FAIL: test_no_warnings_in_log (tests.cloud_tests.testcases.modules.ntp.TestNtp)
Unexpected warnings should not be found in the log.
----------------------------------------------------------------------
Traceback (most recent call last):
  File "/var/lib/jenkins/slaves/torkoal/workspace/cloud-init-integration-ec2-x/cloud-init/tests/cloud_tests/testcases/base.py", line 149, in test_no_warnings_in_log
    [], warnings, msg="'WARN' found inside cloud-init.log")
AssertionError: Lists differ: [] != ['2018-06-10 00:45:55,743 - util.py[WARNING]: No active metadata service found']

Second list contains 1 additional elements.
First extra element 0:
'2018-06-10 00:45:55,743 - util.py[WARNING]: No active metadata service found'

- []
+ ['2018-06-10 00:45:55,743 - util.py[WARNING]: No active metadata service found'] : 'WARN' found inside cloud-init.log

----------------------------------------------------------------------
Ran 8 tests in 0.038s

FAILED (failures=1, skipped=2)
2018-06-10 01:25:31,826 - tests.cloud_tests - WARNING - test case: modules/ntp failed TestNtp.test_no_warnings_in_log with: + ['2018-06-10 00:45:55,743 - util.py[WARNING]: No active metadata service found'] : 'WARN' found inside cloud-init.log
2018-06-10 01:25:31,826 - tests.cloud_tests - DEBUG - verifying test data for modules/timezone
test_instance_data_json_ec2 (tests.cloud_tests.testcases.modules.timezone.TestTimezone)
Validate instance-data.json content by ec2 platform. ... ok
test_instance_data_json_kvm (tests.cloud_tests.testcases.modules.timezone.TestTimezone)
Validate instance-data.json content by nocloud-kvm platform. ... skipped 'Skipping nocloud-kvm instance-data.json on ec2'
test_instance_data_json_lxd (tests.cloud_tests.testcases.modules.timezone.TestTimezone)
Validate instance-data.json content by lxd platform. ... skipped 'Skipping lxd instance-data.json on ec2'
test_no_stages_errors (tests.cloud_tests.testcases.modules.timezone.TestTimezone)
Ensure that there were no errors in any stage. ... ok
test_no_warnings_in_log (tests.cloud_tests.testcases.modules.timezone.TestTimezone)
Unexpected warnings should not be found in the log. ... FAIL
test_timezone (tests.cloud_tests.testcases.modules.timezone.TestTimezone)
Test date prints correct timezone. ... ok

======================================================================
FAIL: test_no_warnings_in_log (tests.cloud_tests.testcases.modules.timezone.TestTimezone)
Unexpected warnings should not be found in the log.
----------------------------------------------------------------------
Traceback (most recent call last):
  File "/var/lib/jenkins/slaves/torkoal/workspace/cloud-init-integration-ec2-x/cloud-init/tests/cloud_tests/testcases/base.py", line 149, in test_no_warnings_in_log
    [], warnings, msg="'WARN' found inside cloud-init.log")
AssertionError: Lists differ: [] != ['2018-06-10 01:20:46,948 - util.py[WARNING]: No active metadata service found']

Second list contains 1 additional elements.
First extra element 0:
'2018-06-10 01:20:46,948 - util.py[WARNING]: No active metadata service found'

- []
+ ['2018-06-10 01:20:46,948 - util.py[WARNING]: No active metadata service found'] : 'WARN' found inside cloud-init.log

----------------------------------------------------------------------
Ran 6 tests in 0.038s

FAILED (failures=1, skipped=2)
2018-06-10 01:25:31,876 - tests.cloud_tests - WARNING - test case: modules/timezone failed TestTimezone.test_no_warnings_in_log with: + ['2018-06-10 01:20:46,948 - util.py[WARNING]: No active metadata service found'] : 'WARN' found inside cloud-init.log
2018-06-10 01:25:31,876 - tests.cloud_tests - DEBUG - verifying test data for modules/keys_to_console
test_excluded_keys (tests.cloud_tests.testcases.modules.keys_to_console.TestKeysToConsole)
Test excluded keys missing. ... ok
test_expected_keys (tests.cloud_tests.testcases.modules.keys_to_console.TestKeysToConsole)
Test expected keys exist. ... ok
test_instance_data_json_ec2 (tests.cloud_tests.testcases.modules.keys_to_console.TestKeysToConsole)
Validate instance-data.json content by ec2 platform. ... ok
test_instance_data_json_kvm (tests.cloud_tests.testcases.modules.keys_to_console.TestKeysToConsole)
Validate instance-data.json content by nocloud-kvm platform. ... skipped 'Skipping nocloud-kvm instance-data.json on ec2'
test_instance_data_json_lxd (tests.cloud_tests.testcases.modules.keys_to_console.TestKeysToConsole)
Validate instance-data.json content by lxd platform. ... skipped 'Skipping lxd instance-data.json on ec2'
test_no_stages_errors (tests.cloud_tests.testcases.modules.keys_to_console.TestKeysToConsole)
Ensure that there were no errors in any stage. ... ok
test_no_warnings_in_log (tests.cloud_tests.testcases.modules.keys_to_console.TestKeysToConsole)
Unexpected warnings should not be found in the log. ... FAIL

======================================================================
FAIL: test_no_warnings_in_log (tests.cloud_tests.testcases.modules.keys_to_console.TestKeysToConsole)
Unexpected warnings should not be found in the log.
----------------------------------------------------------------------
Traceback (most recent call last):
  File "/var/lib/jenkins/slaves/torkoal/workspace/cloud-init-integration-ec2-x/cloud-init/tests/cloud_tests/testcases/base.py", line 149, in test_no_warnings_in_log
    [], warnings, msg="'WARN' found inside cloud-init.log")
AssertionError: Lists differ: [] != ['2018-06-10 00:39:19,043 - util.py[WARNING]: No active metadata service found']

Second list contains 1 additional elements.
First extra element 0:
'2018-06-10 00:39:19,043 - util.py[WARNING]: No active metadata service found'

- []
+ ['2018-06-10 00:39:19,043 - util.py[WARNING]: No active metadata service found'] : 'WARN' found inside cloud-init.log

----------------------------------------------------------------------
Ran 7 tests in 0.038s

FAILED (failures=1, skipped=2)
2018-06-10 01:25:31,922 - tests.cloud_tests - WARNING - test case: modules/keys_to_console failed TestKeysToConsole.test_no_warnings_in_log with: + ['2018-06-10 00:39:19,043 - util.py[WARNING]: No active metadata service found'] : 'WARN' found inside cloud-init.log
2018-06-10 01:25:31,922 - tests.cloud_tests - DEBUG - verifying test data for modules/debug_enable
test_debug_enable (tests.cloud_tests.testcases.modules.debug_enable.TestDebugEnable)
Test debug messages in cloud-init log. ... ok
test_instance_data_json_ec2 (tests.cloud_tests.testcases.modules.debug_enable.TestDebugEnable)
Validate instance-data.json content by ec2 platform. ... ok
test_instance_data_json_kvm (tests.cloud_tests.testcases.modules.debug_enable.TestDebugEnable)
Validate instance-data.json content by nocloud-kvm platform. ... skipped 'Skipping nocloud-kvm instance-data.json on ec2'
test_instance_data_json_lxd (tests.cloud_tests.testcases.modules.debug_enable.TestDebugEnable)
Validate instance-data.json content by lxd platform. ... skipped 'Skipping lxd instance-data.json on ec2'
test_no_stages_errors (tests.cloud_tests.testcases.modules.debug_enable.TestDebugEnable)
Ensure that there were no errors in any stage. ... ok
test_no_warnings_in_log (tests.cloud_tests.testcases.modules.debug_enable.TestDebugEnable)
Unexpected warnings should not be found in the log. ... FAIL

======================================================================
FAIL: test_no_warnings_in_log (tests.cloud_tests.testcases.modules.debug_enable.TestDebugEnable)
Unexpected warnings should not be found in the log.
----------------------------------------------------------------------
Traceback (most recent call last):
  File "/var/lib/jenkins/slaves/torkoal/workspace/cloud-init-integration-ec2-x/cloud-init/tests/cloud_tests/testcases/base.py", line 149, in test_no_warnings_in_log
    [], warnings, msg="'WARN' found inside cloud-init.log")
AssertionError: Lists differ: [] != ['2018-06-10 00:36:38,414 - util.py[WARNING]: No active metadata service found']

Second list contains 1 additional elements.
First extra element 0:
'2018-06-10 00:36:38,414 - util.py[WARNING]: No active metadata service found'

- []
+ ['2018-06-10 00:36:38,414 - util.py[WARNING]: No active metadata service found'] : 'WARN' found inside cloud-init.log

----------------------------------------------------------------------
Ran 6 tests in 0.037s

FAILED (failures=1, skipped=2)
2018-06-10 01:25:31,967 - tests.cloud_tests - WARNING - test case: modules/debug_enable failed TestDebugEnable.test_no_warnings_in_log with: + ['2018-06-10 00:36:38,414 - util.py[WARNING]: No active metadata service found'] : 'WARN' found inside cloud-init.log
2018-06-10 01:25:31,967 - tests.cloud_tests - DEBUG - verifying test data for modules/seed_random_data
test_instance_data_json_ec2 (tests.cloud_tests.testcases.modules.seed_random_data.TestSeedRandom)
Validate instance-data.json content by ec2 platform. ... ok
test_instance_data_json_kvm (tests.cloud_tests.testcases.modules.seed_random_data.TestSeedRandom)
Validate instance-data.json content by nocloud-kvm platform. ... skipped 'Skipping nocloud-kvm instance-data.json on ec2'
test_instance_data_json_lxd (tests.cloud_tests.testcases.modules.seed_random_data.TestSeedRandom)
Validate instance-data.json content by lxd platform. ... skipped 'Skipping lxd instance-data.json on ec2'
test_no_stages_errors (tests.cloud_tests.testcases.modules.seed_random_data.TestSeedRandom)
Ensure that there were no errors in any stage. ... ok
test_no_warnings_in_log (tests.cloud_tests.testcases.modules.seed_random_data.TestSeedRandom)
Unexpected warnings should not be found in the log. ... FAIL
test_random_seed_data (tests.cloud_tests.testcases.modules.seed_random_data.TestSeedRandom)
Test random data passed in exists. ... ok

======================================================================
FAIL: test_no_warnings_in_log (tests.cloud_tests.testcases.modules.seed_random_data.TestSeedRandom)
Unexpected warnings should not be found in the log.
----------------------------------------------------------------------
Traceback (most recent call last):
  File "/var/lib/jenkins/slaves/torkoal/workspace/cloud-init-integration-ec2-x/cloud-init/tests/cloud_tests/testcases/base.py", line 149, in test_no_warnings_in_log
    [], warnings, msg="'WARN' found inside cloud-init.log")
AssertionError: Lists differ: [] != ['2018-06-10 01:00:00,412 - util.py[WARNING]: No active metadata service found']

Second list contains 1 additional elements.
First extra element 0:
'2018-06-10 01:00:00,412 - util.py[WARNING]: No active metadata service found'

- []
+ ['2018-06-10 01:00:00,412 - util.py[WARNING]: No active metadata service found'] : 'WARN' found inside cloud-init.log

----------------------------------------------------------------------
Ran 6 tests in 0.045s

FAILED (failures=1, skipped=2)
2018-06-10 01:25:32,020 - tests.cloud_tests - WARNING - test case: modules/seed_random_data failed TestSeedRandom.test_no_warnings_in_log with: + ['2018-06-10 01:00:00,412 - util.py[WARNING]: No active metadata service found'] : 'WARN' found inside cloud-init.log
2018-06-10 01:25:32,020 - tests.cloud_tests - DEBUG - verifying test data for modules/set_password_list
test_instance_data_json_ec2 (tests.cloud_tests.testcases.modules.set_password_list.TestPasswordList)
Validate instance-data.json content by ec2 platform. ... ok
test_instance_data_json_kvm (tests.cloud_tests.testcases.modules.set_password_list.TestPasswordList)
Validate instance-data.json content by nocloud-kvm platform. ... skipped 'Skipping nocloud-kvm instance-data.json on ec2'
test_instance_data_json_lxd (tests.cloud_tests.testcases.modules.set_password_list.TestPasswordList)
Validate instance-data.json content by lxd platform. ... skipped 'Skipping lxd instance-data.json on ec2'
test_no_stages_errors (tests.cloud_tests.testcases.modules.set_password_list.TestPasswordList)
Ensure that there were no errors in any stage. ... ok
test_no_warnings_in_log (tests.cloud_tests.testcases.modules.set_password_list.TestPasswordList)
Unexpected warnings should not be found in the log. ... FAIL
test_shadow_expected_users (tests.cloud_tests.testcases.modules.set_password_list.TestPasswordList)
Test every tom, dick, and harry user in shadow. ... ok
test_shadow_passwords (tests.cloud_tests.testcases.modules.set_password_list.TestPasswordList)
Test shadow passwords. ... ok
test_sshd_config (tests.cloud_tests.testcases.modules.set_password_list.TestPasswordList)
Test sshd config allows passwords. ... ok

======================================================================
FAIL: test_no_warnings_in_log (tests.cloud_tests.testcases.modules.set_password_list.TestPasswordList)
Unexpected warnings should not be found in the log.
----------------------------------------------------------------------
Traceback (most recent call last):
  File "/var/lib/jenkins/slaves/torkoal/workspace/cloud-init-integration-ec2-x/cloud-init/tests/cloud_tests/testcases/base.py", line 149, in test_no_warnings_in_log
    [], warnings, msg="'WARN' found inside cloud-init.log")
AssertionError: Lists differ: [] != ['2018-06-10 01:07:45,804 - util.py[WARNING]: No active metadata service found']

Second list contains 1 additional elements.
First extra element 0:
'2018-06-10 01:07:45,804 - util.py[WARNING]: No active metadata service found'

- []
+ ['2018-06-10 01:07:45,804 - util.py[WARNING]: No active metadata service found'] : 'WARN' found inside cloud-init.log

----------------------------------------------------------------------
Ran 8 tests in 0.058s

FAILED (failures=1, skipped=2)
2018-06-10 01:25:32,087 - tests.cloud_tests - WARNING - test case: modules/set_password_list failed TestPasswordList.test_no_warnings_in_log with: + ['2018-06-10 01:07:45,804 - util.py[WARNING]: No active metadata service found'] : 'WARN' found inside cloud-init.log
2018-06-10 01:25:32,088 - tests.cloud_tests - DEBUG - verifying test data for modules/user_groups
test_group_cloud_users (tests.cloud_tests.testcases.modules.user_groups.TestUserGroups)
Test cloud users group exists. ... ok
test_group_ubuntu (tests.cloud_tests.testcases.modules.user_groups.TestUserGroups)
Test ubuntu group exists. ... ok
test_instance_data_json_ec2 (tests.cloud_tests.testcases.modules.user_groups.TestUserGroups)
Validate instance-data.json content by ec2 platform. ... ok
test_instance_data_json_kvm (tests.cloud_tests.testcases.modules.user_groups.TestUserGroups)
Validate instance-data.json content by nocloud-kvm platform. ... skipped 'Skipping nocloud-kvm instance-data.json on ec2'
test_instance_data_json_lxd (tests.cloud_tests.testcases.modules.user_groups.TestUserGroups)
Validate instance-data.json content by lxd platform. ... skipped 'Skipping lxd instance-data.json on ec2'
test_no_stages_errors (tests.cloud_tests.testcases.modules.user_groups.TestUserGroups)
Ensure that there were no errors in any stage. ... ok
test_no_warnings_in_log (tests.cloud_tests.testcases.modules.user_groups.TestUserGroups)
Unexpected warnings should not be found in the log. ... FAIL
test_user_barfoo (tests.cloud_tests.testcases.modules.user_groups.TestUserGroups)
Test barfoo user exists. ... ok
test_user_cloudy (tests.cloud_tests.testcases.modules.user_groups.TestUserGroups)
Test cloudy user exists. ... ok
test_user_foobar (tests.cloud_tests.testcases.modules.user_groups.TestUserGroups)
Test foobar user exists. ... ok
test_user_root_in_secret (tests.cloud_tests.testcases.modules.user_groups.TestUserGroups)
Test root user is in 'secret' group. ... ok
test_user_ubuntu (tests.cloud_tests.testcases.modules.user_groups.TestUserGroups)
Test ubuntu user exists. ... ok

======================================================================
FAIL: test_no_warnings_in_log (tests.cloud_tests.testcases.modules.user_groups.TestUserGroups)
Unexpected warnings should not be found in the log.
----------------------------------------------------------------------
Traceback (most recent call last):
  File "/var/lib/jenkins/slaves/torkoal/workspace/cloud-init-integration-ec2-x/cloud-init/tests/cloud_tests/testcases/base.py", line 149, in test_no_warnings_in_log
    [], warnings, msg="'WARN' found inside cloud-init.log")
AssertionError: Lists differ: [] != ['2018-06-10 01:22:21,450 - util.py[WARNING]: No active metadata service found']

Second list contains 1 additional elements.
First extra element 0:
'2018-06-10 01:22:21,450 - util.py[WARNING]: No active metadata service found'

- []
+ ['2018-06-10 01:22:21,450 - util.py[WARNING]: No active metadata service found'] : 'WARN' found inside cloud-init.log

----------------------------------------------------------------------
Ran 12 tests in 0.039s

FAILED (failures=1, skipped=2)
2018-06-10 01:25:32,139 - tests.cloud_tests - WARNING - test case: modules/user_groups failed TestUserGroups.test_no_warnings_in_log with: + ['2018-06-10 01:22:21,450 - util.py[WARNING]: No active metadata service found'] : 'WARN' found inside cloud-init.log
2018-06-10 01:25:32,139 - tests.cloud_tests - DEBUG - verifying test data for modules/debug_disable
test_debug_disable (tests.cloud_tests.testcases.modules.debug_disable.TestDebugDisable)
Test verbose output missing from logs. ... ok
test_instance_data_json_ec2 (tests.cloud_tests.testcases.modules.debug_disable.TestDebugDisable)
Validate instance-data.json content by ec2 platform. ... ok
test_instance_data_json_kvm (tests.cloud_tests.testcases.modules.debug_disable.TestDebugDisable)
Validate instance-data.json content by nocloud-kvm platform. ... skipped 'Skipping nocloud-kvm instance-data.json on ec2'
test_instance_data_json_lxd (tests.cloud_tests.testcases.modules.debug_disable.TestDebugDisable)
Validate instance-data.json content by lxd platform. ... skipped 'Skipping lxd instance-data.json on ec2'
test_no_stages_errors (tests.cloud_tests.testcases.modules.debug_disable.TestDebugDisable)
Ensure that there were no errors in any stage. ... ok
test_no_warnings_in_log (tests.cloud_tests.testcases.modules.debug_disable.TestDebugDisable)
Unexpected warnings should not be found in the log. ... FAIL

======================================================================
FAIL: test_no_warnings_in_log (tests.cloud_tests.testcases.modules.debug_disable.TestDebugDisable)
Unexpected warnings should not be found in the log.
----------------------------------------------------------------------
Traceback (most recent call last):
  File "/var/lib/jenkins/slaves/torkoal/workspace/cloud-init-integration-ec2-x/cloud-init/tests/cloud_tests/testcases/base.py", line 149, in test_no_warnings_in_log
    [], warnings, msg="'WARN' found inside cloud-init.log")
AssertionError: Lists differ: [] != ['2018-06-10 00:35:12,183 - util.py[WARNING]: No active metadata service found']

Second list contains 1 additional elements.
First extra element 0:
'2018-06-10 00:35:12,183 - util.py[WARNING]: No active metadata service found'

- []
+ ['2018-06-10 00:35:12,183 - util.py[WARNING]: No active metadata service found'] : 'WARN' found inside cloud-init.log

----------------------------------------------------------------------
Ran 6 tests in 0.038s

FAILED (failures=1, skipped=2)
2018-06-10 01:25:32,184 - tests.cloud_tests - WARNING - test case: modules/debug_disable failed TestDebugDisable.test_no_warnings_in_log with: + ['2018-06-10 00:35:12,183 - util.py[WARNING]: No active metadata service found'] : 'WARN' found inside cloud-init.log
2018-06-10 01:25:32,184 - tests.cloud_tests - DEBUG - verifying test data for modules/salt_minion
test_grains (tests.cloud_tests.testcases.modules.salt_minion.Test)
Test master value in config. ... ok
test_instance_data_json_ec2 (tests.cloud_tests.testcases.modules.salt_minion.Test)
Validate instance-data.json content by ec2 platform. ... ok
test_instance_data_json_kvm (tests.cloud_tests.testcases.modules.salt_minion.Test)
Validate instance-data.json content by nocloud-kvm platform. ... skipped 'Skipping nocloud-kvm instance-data.json on ec2'
test_instance_data_json_lxd (tests.cloud_tests.testcases.modules.salt_minion.Test)
Validate instance-data.json content by lxd platform. ... skipped 'Skipping lxd instance-data.json on ec2'
test_minion_installed (tests.cloud_tests.testcases.modules.salt_minion.Test)
Test if the salt-minion package is installed ... ok
test_minion_pem (tests.cloud_tests.testcases.modules.salt_minion.Test)
Test private key. ... ok
test_minion_pub (tests.cloud_tests.testcases.modules.salt_minion.Test)
Test public key. ... ok
test_minon_master (tests.cloud_tests.testcases.modules.salt_minion.Test)
Test master value in config. ... ok
test_no_stages_errors (tests.cloud_tests.testcases.modules.salt_minion.Test)
Ensure that there were no errors in any stage. ... ok
test_no_warnings_in_log (tests.cloud_tests.testcases.modules.salt_minion.Test)
Unexpected warnings should not be found in the log. ... FAIL

======================================================================
FAIL: test_no_warnings_in_log (tests.cloud_tests.testcases.modules.salt_minion.Test)
Unexpected warnings should not be found in the log.
----------------------------------------------------------------------
Traceback (most recent call last):
  File "/var/lib/jenkins/slaves/torkoal/workspace/cloud-init-integration-ec2-x/cloud-init/tests/cloud_tests/testcases/base.py", line 149, in test_no_warnings_in_log
    [], warnings, msg="'WARN' found inside cloud-init.log")
AssertionError: Lists differ: [] != ['2018-06-10 00:58:03,905 - util.py[WARNING]: No active metadata service found']

Second list contains 1 additional elements.
First extra element 0:
'2018-06-10 00:58:03,905 - util.py[WARNING]: No active metadata service found'

- []
+ ['2018-06-10 00:58:03,905 - util.py[WARNING]: No active metadata service found'] : 'WARN' found inside cloud-init.log

----------------------------------------------------------------------
Ran 10 tests in 0.038s

FAILED (failures=1, skipped=2)
2018-06-10 01:25:32,232 - tests.cloud_tests - WARNING - test case: modules/salt_minion failed Test.test_no_warnings_in_log with: + ['2018-06-10 00:58:03,905 - util.py[WARNING]: No active metadata service found'] : 'WARN' found inside cloud-init.log
2018-06-10 01:25:32,232 - tests.cloud_tests - DEBUG - verifying test data for modules/byobu
test_byobu_installed (tests.cloud_tests.testcases.modules.byobu.TestByobu)
Test byobu installed. ... ok
test_byobu_launch_exists (tests.cloud_tests.testcases.modules.byobu.TestByobu)
Test byobu-launch exists. ... ok
test_byobu_profile_enabled (tests.cloud_tests.testcases.modules.byobu.TestByobu)
Test byobu profile.d file exists. ... ok
test_instance_data_json_ec2 (tests.cloud_tests.testcases.modules.byobu.TestByobu)
Validate instance-data.json content by ec2 platform. ... ok
test_instance_data_json_kvm (tests.cloud_tests.testcases.modules.byobu.TestByobu)
Validate instance-data.json content by nocloud-kvm platform. ... skipped 'Skipping nocloud-kvm instance-data.json on ec2'
test_instance_data_json_lxd (tests.cloud_tests.testcases.modules.byobu.TestByobu)
Validate instance-data.json content by lxd platform. ... skipped 'Skipping lxd instance-data.json on ec2'
test_no_stages_errors (tests.cloud_tests.testcases.modules.byobu.TestByobu)
Ensure that there were no errors in any stage. ... ok
test_no_warnings_in_log (tests.cloud_tests.testcases.modules.byobu.TestByobu)
Unexpected warnings should not be found in the log. ... FAIL

======================================================================
FAIL: test_no_warnings_in_log (tests.cloud_tests.testcases.modules.byobu.TestByobu)
Unexpected warnings should not be found in the log.
----------------------------------------------------------------------
Traceback (most recent call last):
  File "/var/lib/jenkins/slaves/torkoal/workspace/cloud-init-integration-ec2-x/cloud-init/tests/cloud_tests/testcases/base.py", line 149, in test_no_warnings_in_log
    [], warnings, msg="'WARN' found inside cloud-init.log")
AssertionError: Lists differ: [] != ['2018-06-10 00:31:50,975 - util.py[WARNING]: No active metadata service found']

Second list contains 1 additional elements.
First extra element 0:
'2018-06-10 00:31:50,975 - util.py[WARNING]: No active metadata service found'

- []
+ ['2018-06-10 00:31:50,975 - util.py[WARNING]: No active metadata service found'] : 'WARN' found inside cloud-init.log

----------------------------------------------------------------------
Ran 8 tests in 0.038s

FAILED (failures=1, skipped=2)
2018-06-10 01:25:32,278 - tests.cloud_tests - WARNING - test case: modules/byobu failed TestByobu.test_no_warnings_in_log with: + ['2018-06-10 00:31:50,975 - util.py[WARNING]: No active metadata service found'] : 'WARN' found inside cloud-init.log
2018-06-10 01:25:32,278 - tests.cloud_tests - DEBUG - verifying test data for modules/apt_configure_proxy
test_instance_data_json_ec2 (tests.cloud_tests.testcases.modules.apt_configure_proxy.TestAptconfigureProxy)
Validate instance-data.json content by ec2 platform. ... ok
test_instance_data_json_kvm (tests.cloud_tests.testcases.modules.apt_configure_proxy.TestAptconfigureProxy)
Validate instance-data.json content by nocloud-kvm platform. ... skipped 'Skipping nocloud-kvm instance-data.json on ec2'
test_instance_data_json_lxd (tests.cloud_tests.testcases.modules.apt_configure_proxy.TestAptconfigureProxy)
Validate instance-data.json content by lxd platform. ... skipped 'Skipping lxd instance-data.json on ec2'
test_no_stages_errors (tests.cloud_tests.testcases.modules.apt_configure_proxy.TestAptconfigureProxy)
Ensure that there were no errors in any stage. ... ok
test_no_warnings_in_log (tests.cloud_tests.testcases.modules.apt_configure_proxy.TestAptconfigureProxy)
Unexpected warnings should not be found in the log. ... FAIL
test_proxy_config (tests.cloud_tests.testcases.modules.apt_configure_proxy.TestAptconfigureProxy)
Test proxy options added to apt config. ... ok

======================================================================
FAIL: test_no_warnings_in_log (tests.cloud_tests.testcases.modules.apt_configure_proxy.TestAptconfigureProxy)
Unexpected warnings should not be found in the log.
----------------------------------------------------------------------
Traceback (most recent call last):
  File "/var/lib/jenkins/slaves/torkoal/workspace/cloud-init-integration-ec2-x/cloud-init/tests/cloud_tests/testcases/base.py", line 149, in test_no_warnings_in_log
    [], warnings, msg="'WARN' found inside cloud-init.log")
AssertionError: Lists differ: [] != ['2018-06-10 00:16:55,189 - util.py[WARNING]: No active metadata service found']

Second list contains 1 additional elements.
First extra element 0:
'2018-06-10 00:16:55,189 - util.py[WARNING]: No active metadata service found'

- []
+ ['2018-06-10 00:16:55,189 - util.py[WARNING]: No active metadata service found'] : 'WARN' found inside cloud-init.log

----------------------------------------------------------------------
Ran 6 tests in 0.037s

FAILED (failures=1, skipped=2)
2018-06-10 01:25:32,323 - tests.cloud_tests - WARNING - test case: modules/apt_configure_proxy failed TestAptconfigureProxy.test_no_warnings_in_log with: + ['2018-06-10 00:16:55,189 - util.py[WARNING]: No active metadata service found'] : 'WARN' found inside cloud-init.log
2018-06-10 01:25:32,323 - tests.cloud_tests - DEBUG - verifying test data for modules/apt_configure_sources_ppa
test_instance_data_json_ec2 (tests.cloud_tests.testcases.modules.apt_configure_sources_ppa.TestAptconfigureSourcesPPA)
Validate instance-data.json content by ec2 platform. ... ok
test_instance_data_json_kvm (tests.cloud_tests.testcases.modules.apt_configure_sources_ppa.TestAptconfigureSourcesPPA)
Validate instance-data.json content by nocloud-kvm platform. ... skipped 'Skipping nocloud-kvm instance-data.json on ec2'
test_instance_data_json_lxd (tests.cloud_tests.testcases.modules.apt_configure_sources_ppa.TestAptconfigureSourcesPPA)
Validate instance-data.json content by lxd platform. ... skipped 'Skipping lxd instance-data.json on ec2'
test_no_stages_errors (tests.cloud_tests.testcases.modules.apt_configure_sources_ppa.TestAptconfigureSourcesPPA)
Ensure that there were no errors in any stage. ... ok
test_no_warnings_in_log (tests.cloud_tests.testcases.modules.apt_configure_sources_ppa.TestAptconfigureSourcesPPA)
Unexpected warnings should not be found in the log. ... FAIL
test_ppa (tests.cloud_tests.testcases.modules.apt_configure_sources_ppa.TestAptconfigureSourcesPPA)
Test specific ppa added. ... ok
test_ppa_key (tests.cloud_tests.testcases.modules.apt_configure_sources_ppa.TestAptconfigureSourcesPPA)
Test ppa key added. ... ok

======================================================================
FAIL: test_no_warnings_in_log (tests.cloud_tests.testcases.modules.apt_configure_sources_ppa.TestAptconfigureSourcesPPA)
Unexpected warnings should not be found in the log.
----------------------------------------------------------------------
Traceback (most recent call last):
  File "/var/lib/jenkins/slaves/torkoal/workspace/cloud-init-integration-ec2-x/cloud-init/tests/cloud_tests/testcases/base.py", line 149, in test_no_warnings_in_log
    [], warnings, msg="'WARN' found inside cloud-init.log")
AssertionError: Lists differ: [] != ['2018-06-10 00:25:13,785 - util.py[WARNING]: No active metadata service found']

Second list contains 1 additional elements.
First extra element 0:
'2018-06-10 00:25:13,785 - util.py[WARNING]: No active metadata service found'

- []
+ ['2018-06-10 00:25:13,785 - util.py[WARNING]: No active metadata service found'] : 'WARN' found inside cloud-init.log

----------------------------------------------------------------------
Ran 7 tests in 0.039s

FAILED (failures=1, skipped=2)
2018-06-10 01:25:32,371 - tests.cloud_tests - WARNING - test case: modules/apt_configure_sources_ppa failed TestAptconfigureSourcesPPA.test_no_warnings_in_log with: + ['2018-06-10 00:25:13,785 - util.py[WARNING]: No active metadata service found'] : 'WARN' found inside cloud-init.log
2018-06-10 01:25:32,371 - tests.cloud_tests - DEBUG - verifying test data for modules/package_update_upgrade_install
test_apt_history (tests.cloud_tests.testcases.modules.package_update_upgrade_install.TestPackageInstallUpdateUpgrade)
Test apt history for update command. ... ok
test_cloud_init_output (tests.cloud_tests.testcases.modules.package_update_upgrade_install.TestPackageInstallUpdateUpgrade)
Test cloud-init-output for install & upgrade stuff. ... ok
test_installed_sl (tests.cloud_tests.testcases.modules.package_update_upgrade_install.TestPackageInstallUpdateUpgrade)
Test sl got installed. ... ok
test_installed_tree (tests.cloud_tests.testcases.modules.package_update_upgrade_install.TestPackageInstallUpdateUpgrade)
Test tree got installed. ... ok
test_instance_data_json_ec2 (tests.cloud_tests.testcases.modules.package_update_upgrade_install.TestPackageInstallUpdateUpgrade)
Validate instance-data.json content by ec2 platform. ... ok
test_instance_data_json_kvm (tests.cloud_tests.testcases.modules.package_update_upgrade_install.TestPackageInstallUpdateUpgrade)
Validate instance-data.json content by nocloud-kvm platform. ... skipped 'Skipping nocloud-kvm instance-data.json on ec2'
test_instance_data_json_lxd (tests.cloud_tests.testcases.modules.package_update_upgrade_install.TestPackageInstallUpdateUpgrade)
Validate instance-data.json content by lxd platform. ... skipped 'Skipping lxd instance-data.json on ec2'
test_no_stages_errors (tests.cloud_tests.testcases.modules.package_update_upgrade_install.TestPackageInstallUpdateUpgrade)
Ensure that there were no errors in any stage. ... ok
test_no_warnings_in_log (tests.cloud_tests.testcases.modules.package_update_upgrade_install.TestPackageInstallUpdateUpgrade)
Unexpected warnings should not be found in the log. ... FAIL

======================================================================
FAIL: test_no_warnings_in_log (tests.cloud_tests.testcases.modules.package_update_upgrade_install.TestPackageInstallUpdateUpgrade)
Unexpected warnings should not be found in the log.
----------------------------------------------------------------------
Traceback (most recent call last):
  File "/var/lib/jenkins/slaves/torkoal/workspace/cloud-init-integration-ec2-x/cloud-init/tests/cloud_tests/testcases/base.py", line 149, in test_no_warnings_in_log
    [], warnings, msg="'WARN' found inside cloud-init.log")
AssertionError: Lists differ: [] != ['2018-06-10 00:54:40,345 - util.py[WARNING]: No active metadata service found']

Second list contains 1 additional elements.
First extra element 0:
'2018-06-10 00:54:40,345 - util.py[WARNING]: No active metadata service found'

- []
+ ['2018-06-10 00:54:40,345 - util.py[WARNING]: No active metadata service found'] : 'WARN' found inside cloud-init.log

----------------------------------------------------------------------
Ran 9 tests in 0.038s

FAILED (failures=1, skipped=2)
2018-06-10 01:25:32,418 - tests.cloud_tests - WARNING - test case: modules/package_update_upgrade_install failed TestPackageInstallUpdateUpgrade.test_no_warnings_in_log with: + ['2018-06-10 00:54:40,345 - util.py[WARNING]: No active metadata service found'] : 'WARN' found inside cloud-init.log
2018-06-10 01:25:32,419 - tests.cloud_tests - DEBUG - verifying test data for modules/ntp_timesyncd
test_instance_data_json_ec2 (tests.cloud_tests.testcases.modules.ntp_timesyncd.TestNtpTimesyncd)
Validate instance-data.json content by ec2 platform. ... ok
test_instance_data_json_kvm (tests.cloud_tests.testcases.modules.ntp_timesyncd.TestNtpTimesyncd)
Validate instance-data.json content by nocloud-kvm platform. ... skipped 'Skipping nocloud-kvm instance-data.json on ec2'
test_instance_data_json_lxd (tests.cloud_tests.testcases.modules.ntp_timesyncd.TestNtpTimesyncd)
Validate instance-data.json content by lxd platform. ... skipped 'Skipping lxd instance-data.json on ec2'
test_no_stages_errors (tests.cloud_tests.testcases.modules.ntp_timesyncd.TestNtpTimesyncd)
Ensure that there were no errors in any stage. ... ok
test_no_warnings_in_log (tests.cloud_tests.testcases.modules.ntp_timesyncd.TestNtpTimesyncd)
Unexpected warnings should not be found in the log. ... FAIL
test_timesyncd_entries (tests.cloud_tests.testcases.modules.ntp_timesyncd.TestNtpTimesyncd)
Test timesyncd config entries ... ok

======================================================================
FAIL: test_no_warnings_in_log (tests.cloud_tests.testcases.modules.ntp_timesyncd.TestNtpTimesyncd)
Unexpected warnings should not be found in the log.
----------------------------------------------------------------------
Traceback (most recent call last):
  File "/var/lib/jenkins/slaves/torkoal/workspace/cloud-init-integration-ec2-x/cloud-init/tests/cloud_tests/testcases/base.py", line 149, in test_no_warnings_in_log
    [], warnings, msg="'WARN' found inside cloud-init.log")
AssertionError: Lists differ: [] != ['2018-06-10 00:53:04,275 - util.py[WARNING]: No active metadata service found']

Second list contains 1 additional elements.
First extra element 0:
'2018-06-10 00:53:04,275 - util.py[WARNING]: No active metadata service found'

- []
+ ['2018-06-10 00:53:04,275 - util.py[WARNING]: No active metadata service found'] : 'WARN' found inside cloud-init.log

----------------------------------------------------------------------
Ran 6 tests in 0.037s

FAILED (failures=1, skipped=2)
2018-06-10 01:25:32,464 - tests.cloud_tests - WARNING - test case: modules/ntp_timesyncd failed TestNtpTimesyncd.test_no_warnings_in_log with: + ['2018-06-10 00:53:04,275 - util.py[WARNING]: No active metadata service found'] : 'WARN' found inside cloud-init.log
2018-06-10 01:25:32,464 - tests.cloud_tests - DEBUG - verifying test data for modules/lxd_dir
test_instance_data_json_ec2 (tests.cloud_tests.testcases.modules.lxd_dir.TestLxdDir)
Validate instance-data.json content by ec2 platform. ... ok
test_instance_data_json_kvm (tests.cloud_tests.testcases.modules.lxd_dir.TestLxdDir)
Validate instance-data.json content by nocloud-kvm platform. ... skipped 'Skipping nocloud-kvm instance-data.json on ec2'
test_instance_data_json_lxd (tests.cloud_tests.testcases.modules.lxd_dir.TestLxdDir)
Validate instance-data.json content by lxd platform. ... skipped 'Skipping lxd instance-data.json on ec2'
test_lxc (tests.cloud_tests.testcases.modules.lxd_dir.TestLxdDir)
Test lxc installed. ... ok
test_lxd (tests.cloud_tests.testcases.modules.lxd_dir.TestLxdDir)
Test lxd installed. ... ok
test_no_stages_errors (tests.cloud_tests.testcases.modules.lxd_dir.TestLxdDir)
Ensure that there were no errors in any stage. ... ok
test_no_warnings_in_log (tests.cloud_tests.testcases.modules.lxd_dir.TestLxdDir)
Unexpected warnings should not be found in the log. ... FAIL

======================================================================
FAIL: test_no_warnings_in_log (tests.cloud_tests.testcases.modules.lxd_dir.TestLxdDir)
Unexpected warnings should not be found in the log.
----------------------------------------------------------------------
Traceback (most recent call last):
  File "/var/lib/jenkins/slaves/torkoal/workspace/cloud-init-integration-ec2-x/cloud-init/tests/cloud_tests/testcases/base.py", line 149, in test_no_warnings_in_log
    [], warnings, msg="'WARN' found inside cloud-init.log")
AssertionError: Lists differ: [] != ['2018-06-10 00:44:18,706 - util.py[WARNING]: No active metadata service found']

Second list contains 1 additional elements.
First extra element 0:
'2018-06-10 00:44:18,706 - util.py[WARNING]: No active metadata service found'

- []
+ ['2018-06-10 00:44:18,706 - util.py[WARNING]: No active metadata service found'] : 'WARN' found inside cloud-init.log

----------------------------------------------------------------------
Ran 7 tests in 0.037s

FAILED (failures=1, skipped=2)
2018-06-10 01:25:32,510 - tests.cloud_tests - WARNING - test case: modules/lxd_dir failed TestLxdDir.test_no_warnings_in_log with: + ['2018-06-10 00:44:18,706 - util.py[WARNING]: No active metadata service found'] : 'WARN' found inside cloud-init.log
2018-06-10 01:25:32,510 - tests.cloud_tests - DEBUG - verifying test data for modules/apt_pipelining_disable
test_disable_pipelining (tests.cloud_tests.testcases.modules.apt_pipelining_disable.TestAptPipeliningDisable)
Test pipelining disabled. ... ok
test_instance_data_json_ec2 (tests.cloud_tests.testcases.modules.apt_pipelining_disable.TestAptPipeliningDisable)
Validate instance-data.json content by ec2 platform. ... ok
test_instance_data_json_kvm (tests.cloud_tests.testcases.modules.apt_pipelining_disable.TestAptPipeliningDisable)
Validate instance-data.json content by nocloud-kvm platform. ... skipped 'Skipping nocloud-kvm instance-data.json on ec2'
test_instance_data_json_lxd (tests.cloud_tests.testcases.modules.apt_pipelining_disable.TestAptPipeliningDisable)
Validate instance-data.json content by lxd platform. ... skipped 'Skipping lxd instance-data.json on ec2'
test_no_stages_errors (tests.cloud_tests.testcases.modules.apt_pipelining_disable.TestAptPipeliningDisable)
Ensure that there were no errors in any stage. ... ok
test_no_warnings_in_log (tests.cloud_tests.testcases.modules.apt_pipelining_disable.TestAptPipeliningDisable)
Unexpected warnings should not be found in the log. ... FAIL

======================================================================
FAIL: test_no_warnings_in_log (tests.cloud_tests.testcases.modules.apt_pipelining_disable.TestAptPipeliningDisable)
Unexpected warnings should not be found in the log.
----------------------------------------------------------------------
Traceback (most recent call last):
  File "/var/lib/jenkins/slaves/torkoal/workspace/cloud-init-integration-ec2-x/cloud-init/tests/cloud_tests/testcases/base.py", line 149, in test_no_warnings_in_log
    [], warnings, msg="'WARN' found inside cloud-init.log")
AssertionError: Lists differ: [] != ['2018-06-10 00:27:03,059 - util.py[WARNING]: No active metadata service found']

Second list contains 1 additional elements.
First extra element 0:
'2018-06-10 00:27:03,059 - util.py[WARNING]: No active metadata service found'

- []
+ ['2018-06-10 00:27:03,059 - util.py[WARNING]: No active metadata service found'] : 'WARN' found inside cloud-init.log

----------------------------------------------------------------------
Ran 6 tests in 0.037s

FAILED (failures=1, skipped=2)
2018-06-10 01:25:32,555 - tests.cloud_tests - WARNING - test case: modules/apt_pipelining_disable failed TestAptPipeliningDisable.test_no_warnings_in_log with: + ['2018-06-10 00:27:03,059 - util.py[WARNING]: No active metadata service found'] : 'WARN' found inside cloud-init.log
2018-06-10 01:25:32,555 - tests.cloud_tests - DEBUG - verifying test data for modules/runcmd
test_instance_data_json_ec2 (tests.cloud_tests.testcases.modules.runcmd.TestRunCmd)
Validate instance-data.json content by ec2 platform. ... ok
test_instance_data_json_kvm (tests.cloud_tests.testcases.modules.runcmd.TestRunCmd)
Validate instance-data.json content by nocloud-kvm platform. ... skipped 'Skipping nocloud-kvm instance-data.json on ec2'
test_instance_data_json_lxd (tests.cloud_tests.testcases.modules.runcmd.TestRunCmd)
Validate instance-data.json content by lxd platform. ... skipped 'Skipping lxd instance-data.json on ec2'
test_no_stages_errors (tests.cloud_tests.testcases.modules.runcmd.TestRunCmd)
Ensure that there were no errors in any stage. ... ok
test_no_warnings_in_log (tests.cloud_tests.testcases.modules.runcmd.TestRunCmd)
Unexpected warnings should not be found in the log. ... FAIL
test_run_cmd (tests.cloud_tests.testcases.modules.runcmd.TestRunCmd)
Test run command worked. ... ok

======================================================================
FAIL: test_no_warnings_in_log (tests.cloud_tests.testcases.modules.runcmd.TestRunCmd)
Unexpected warnings should not be found in the log.
----------------------------------------------------------------------
Traceback (most recent call last):
  File "/var/lib/jenkins/slaves/torkoal/workspace/cloud-init-integration-ec2-x/cloud-init/tests/cloud_tests/testcases/base.py", line 149, in test_no_warnings_in_log
    [], warnings, msg="'WARN' found inside cloud-init.log")
AssertionError: Lists differ: [] != ['2018-06-10 00:56:29,886 - util.py[WARNING]: No active metadata service found']

Second list contains 1 additional elements.
First extra element 0:
'2018-06-10 00:56:29,886 - util.py[WARNING]: No active metadata service found'

- []
+ ['2018-06-10 00:56:29,886 - util.py[WARNING]: No active metadata service found'] : 'WARN' found inside cloud-init.log

----------------------------------------------------------------------
Ran 6 tests in 0.037s

FAILED (failures=1, skipped=2)
2018-06-10 01:25:32,599 - tests.cloud_tests - WARNING - test case: modules/runcmd failed TestRunCmd.test_no_warnings_in_log with: + ['2018-06-10 00:56:29,886 - util.py[WARNING]: No active metadata service found'] : 'WARN' found inside cloud-init.log
2018-06-10 01:25:32,600 - tests.cloud_tests - DEBUG - verifying test data for modules/set_hostname
test_hostname (tests.cloud_tests.testcases.modules.set_hostname.TestHostname)
Test hostname command shows correct output. ... ok
test_instance_data_json_ec2 (tests.cloud_tests.testcases.modules.set_hostname.TestHostname)
Validate instance-data.json content by ec2 platform. ... ok
test_instance_data_json_kvm (tests.cloud_tests.testcases.modules.set_hostname.TestHostname)
Validate instance-data.json content by nocloud-kvm platform. ... skipped 'Skipping nocloud-kvm instance-data.json on ec2'
test_instance_data_json_lxd (tests.cloud_tests.testcases.modules.set_hostname.TestHostname)
Validate instance-data.json content by lxd platform. ... skipped 'Skipping lxd instance-data.json on ec2'
test_no_stages_errors (tests.cloud_tests.testcases.modules.set_hostname.TestHostname)
Ensure that there were no errors in any stage. ... ok
test_no_warnings_in_log (tests.cloud_tests.testcases.modules.set_hostname.TestHostname)
Unexpected warnings should not be found in the log. ... FAIL

======================================================================
FAIL: test_no_warnings_in_log (tests.cloud_tests.testcases.modules.set_hostname.TestHostname)
Unexpected warnings should not be found in the log.
----------------------------------------------------------------------
Traceback (most recent call last):
  File "/var/lib/jenkins/slaves/torkoal/workspace/cloud-init-integration-ec2-x/cloud-init/tests/cloud_tests/testcases/base.py", line 149, in test_no_warnings_in_log
    [], warnings, msg="'WARN' found inside cloud-init.log")
AssertionError: Lists differ: [] != ['2018-06-10 01:01:38,547 - util.py[WARNING]: No active metadata service found']

Second list contains 1 additional elements.
First extra element 0:
'2018-06-10 01:01:38,547 - util.py[WARNING]: No active metadata service found'

- []
+ ['2018-06-10 01:01:38,547 - util.py[WARNING]: No active metadata service found'] : 'WARN' found inside cloud-init.log

----------------------------------------------------------------------
Ran 6 tests in 0.037s

FAILED (failures=1, skipped=2)
2018-06-10 01:25:32,645 - tests.cloud_tests - WARNING - test case: modules/set_hostname failed TestHostname.test_no_warnings_in_log with: + ['2018-06-10 01:01:38,547 - util.py[WARNING]: No active metadata service found'] : 'WARN' found inside cloud-init.log
2018-06-10 01:25:32,645 - tests.cloud_tests - DEBUG - verifying test data for modules/apt_configure_conf
test_apt_conf_assumeyes (tests.cloud_tests.testcases.modules.apt_configure_conf.TestAptconfigureConf)
Test config assumes true. ... ok
test_apt_conf_fixbroken (tests.cloud_tests.testcases.modules.apt_configure_conf.TestAptconfigureConf)
Test config fixes broken. ... ok
test_instance_data_json_ec2 (tests.cloud_tests.testcases.modules.apt_configure_conf.TestAptconfigureConf)
Validate instance-data.json content by ec2 platform. ... ok
test_instance_data_json_kvm (tests.cloud_tests.testcases.modules.apt_configure_conf.TestAptconfigureConf)
Validate instance-data.json content by nocloud-kvm platform. ... skipped 'Skipping nocloud-kvm instance-data.json on ec2'
test_instance_data_json_lxd (tests.cloud_tests.testcases.modules.apt_configure_conf.TestAptconfigureConf)
Validate instance-data.json content by lxd platform. ... skipped 'Skipping lxd instance-data.json on ec2'
test_no_stages_errors (tests.cloud_tests.testcases.modules.apt_configure_conf.TestAptconfigureConf)
Ensure that there were no errors in any stage. ... ok
test_no_warnings_in_log (tests.cloud_tests.testcases.modules.apt_configure_conf.TestAptconfigureConf)
Unexpected warnings should not be found in the log. ... FAIL

======================================================================
FAIL: test_no_warnings_in_log (tests.cloud_tests.testcases.modules.apt_configure_conf.TestAptconfigureConf)
Unexpected warnings should not be found in the log.
----------------------------------------------------------------------
Traceback (most recent call last):
  File "/var/lib/jenkins/slaves/torkoal/workspace/cloud-init-integration-ec2-x/cloud-init/tests/cloud_tests/testcases/base.py", line 149, in test_no_warnings_in_log
    [], warnings, msg="'WARN' found inside cloud-init.log")
AssertionError: Lists differ: [] != ['2018-06-10 00:12:02,792 - util.py[WARNING]: No active metadata service found']

Second list contains 1 additional elements.
First extra element 0:
'2018-06-10 00:12:02,792 - util.py[WARNING]: No active metadata service found'

- []
+ ['2018-06-10 00:12:02,792 - util.py[WARNING]: No active metadata service found'] : 'WARN' found inside cloud-init.log

----------------------------------------------------------------------
Ran 7 tests in 0.037s

FAILED (failures=1, skipped=2)
2018-06-10 01:25:32,690 - tests.cloud_tests - WARNING - test case: modules/apt_configure_conf failed TestAptconfigureConf.test_no_warnings_in_log with: + ['2018-06-10 00:12:02,792 - util.py[WARNING]: No active metadata service found'] : 'WARN' found inside cloud-init.log
2018-06-10 01:25:32,690 - tests.cloud_tests - DEBUG - verifying test data for modules/apt_configure_disable_suites
test_empty_sourcelist (tests.cloud_tests.testcases.modules.apt_configure_disable_suites.TestAptconfigureDisableSuites)
Test source list is empty. ... ok
test_instance_data_json_ec2 (tests.cloud_tests.testcases.modules.apt_configure_disable_suites.TestAptconfigureDisableSuites)
Validate instance-data.json content by ec2 platform. ... ok
test_instance_data_json_kvm (tests.cloud_tests.testcases.modules.apt_configure_disable_suites.TestAptconfigureDisableSuites)
Validate instance-data.json content by nocloud-kvm platform. ... skipped 'Skipping nocloud-kvm instance-data.json on ec2'
test_instance_data_json_lxd (tests.cloud_tests.testcases.modules.apt_configure_disable_suites.TestAptconfigureDisableSuites)
Validate instance-data.json content by lxd platform. ... skipped 'Skipping lxd instance-data.json on ec2'
test_no_stages_errors (tests.cloud_tests.testcases.modules.apt_configure_disable_suites.TestAptconfigureDisableSuites)
Ensure that there were no errors in any stage. ... ok
test_no_warnings_in_log (tests.cloud_tests.testcases.modules.apt_configure_disable_suites.TestAptconfigureDisableSuites)
Unexpected warnings should not be found in the log. ... FAIL

======================================================================
FAIL: test_no_warnings_in_log (tests.cloud_tests.testcases.modules.apt_configure_disable_suites.TestAptconfigureDisableSuites)
Unexpected warnings should not be found in the log.
----------------------------------------------------------------------
Traceback (most recent call last):
  File "/var/lib/jenkins/slaves/torkoal/workspace/cloud-init-integration-ec2-x/cloud-init/tests/cloud_tests/testcases/base.py", line 149, in test_no_warnings_in_log
    [], warnings, msg="'WARN' found inside cloud-init.log")
AssertionError: Lists differ: [] != ['2018-06-10 00:13:38,986 - util.py[WARNING]: No active metadata service found']

Second list contains 1 additional elements.
First extra element 0:
'2018-06-10 00:13:38,986 - util.py[WARNING]: No active metadata service found'

- []
+ ['2018-06-10 00:13:38,986 - util.py[WARNING]: No active metadata service found'] : 'WARN' found inside cloud-init.log

----------------------------------------------------------------------
Ran 6 tests in 0.039s

FAILED (failures=1, skipped=2)
2018-06-10 01:25:32,738 - tests.cloud_tests - WARNING - test case: modules/apt_configure_disable_suites failed TestAptconfigureDisableSuites.test_no_warnings_in_log with: + ['2018-06-10 00:13:38,986 - util.py[WARNING]: No active metadata service found'] : 'WARN' found inside cloud-init.log
2018-06-10 01:25:32,738 - tests.cloud_tests - DEBUG - verifying test data for modules/set_password_list_string
test_instance_data_json_ec2 (tests.cloud_tests.testcases.modules.set_password_list_string.TestPasswordListString)
Validate instance-data.json content by ec2 platform. ... ok
test_instance_data_json_kvm (tests.cloud_tests.testcases.modules.set_password_list_string.TestPasswordListString)
Validate instance-data.json content by nocloud-kvm platform. ... skipped 'Skipping nocloud-kvm instance-data.json on ec2'
test_instance_data_json_lxd (tests.cloud_tests.testcases.modules.set_password_list_string.TestPasswordListString)
Validate instance-data.json content by lxd platform. ... skipped 'Skipping lxd instance-data.json on ec2'
test_no_stages_errors (tests.cloud_tests.testcases.modules.set_password_list_string.TestPasswordListString)
Ensure that there were no errors in any stage. ... ok
test_no_warnings_in_log (tests.cloud_tests.testcases.modules.set_password_list_string.TestPasswordListString)
Unexpected warnings should not be found in the log. ... FAIL
test_shadow_expected_users (tests.cloud_tests.testcases.modules.set_password_list_string.TestPasswordListString)
Test every tom, dick, and harry user in shadow. ... ok
test_shadow_passwords (tests.cloud_tests.testcases.modules.set_password_list_string.TestPasswordListString)
Test shadow passwords. ... ok
test_sshd_config (tests.cloud_tests.testcases.modules.set_password_list_string.TestPasswordListString)
Test sshd config allows passwords. ... ok

======================================================================
FAIL: test_no_warnings_in_log (tests.cloud_tests.testcases.modules.set_password_list_string.TestPasswordListString)
Unexpected warnings should not be found in the log.
----------------------------------------------------------------------
Traceback (most recent call last):
  File "/var/lib/jenkins/slaves/torkoal/workspace/cloud-init-integration-ec2-x/cloud-init/tests/cloud_tests/testcases/base.py", line 149, in test_no_warnings_in_log
    [], warnings, msg="'WARN' found inside cloud-init.log")
AssertionError: Lists differ: [] != ['2018-06-10 01:09:33,232 - util.py[WARNING]: No active metadata service found']

Second list contains 1 additional elements.
First extra element 0:
'2018-06-10 01:09:33,232 - util.py[WARNING]: No active metadata service found'

- []
+ ['2018-06-10 01:09:33,232 - util.py[WARNING]: No active metadata service found'] : 'WARN' found inside cloud-init.log

----------------------------------------------------------------------
Ran 8 tests in 0.079s

FAILED (failures=1, skipped=2)
2018-06-10 01:25:32,832 - tests.cloud_tests - WARNING - test case: modules/set_password_list_string failed TestPasswordListString.test_no_warnings_in_log with: + ['2018-06-10 01:09:33,232 - util.py[WARNING]: No active metadata service found'] : 'WARN' found inside cloud-init.log
2018-06-10 01:25:32,832 - tests.cloud_tests - DEBUG - verifying test data for modules/set_password_expire
test_instance_data_json_ec2 (tests.cloud_tests.testcases.modules.set_password_expire.TestPasswordExpire)
Validate instance-data.json content by ec2 platform. ... ok
test_instance_data_json_kvm (tests.cloud_tests.testcases.modules.set_password_expire.TestPasswordExpire)
Validate instance-data.json content by nocloud-kvm platform. ... skipped 'Skipping nocloud-kvm instance-data.json on ec2'
test_instance_data_json_lxd (tests.cloud_tests.testcases.modules.set_password_expire.TestPasswordExpire)
Validate instance-data.json content by lxd platform. ... skipped 'Skipping lxd instance-data.json on ec2'
test_no_stages_errors (tests.cloud_tests.testcases.modules.set_password_expire.TestPasswordExpire)
Ensure that there were no errors in any stage. ... ok
test_no_warnings_in_log (tests.cloud_tests.testcases.modules.set_password_expire.TestPasswordExpire)
Unexpected warnings should not be found in the log. ... FAIL
test_shadow (tests.cloud_tests.testcases.modules.set_password_expire.TestPasswordExpire)
Test user frozen in shadow. ... ok
test_sshd_config (tests.cloud_tests.testcases.modules.set_password_expire.TestPasswordExpire)
Test sshd config allows passwords. ... ok

======================================================================
FAIL: test_no_warnings_in_log (tests.cloud_tests.testcases.modules.set_password_expire.TestPasswordExpire)
Unexpected warnings should not be found in the log.
----------------------------------------------------------------------
Traceback (most recent call last):
  File "/var/lib/jenkins/slaves/torkoal/workspace/cloud-init-integration-ec2-x/cloud-init/tests/cloud_tests/testcases/base.py", line 149, in test_no_warnings_in_log
    [], warnings, msg="'WARN' found inside cloud-init.log")
AssertionError: Lists differ: [] != ['2018-06-10 01:06:09,589 - util.py[WARNING]: No active metadata service found']

Second list contains 1 additional elements.
First extra element 0:
'2018-06-10 01:06:09,589 - util.py[WARNING]: No active metadata service found'

- []
+ ['2018-06-10 01:06:09,589 - util.py[WARNING]: No active metadata service found'] : 'WARN' found inside cloud-init.log

----------------------------------------------------------------------
Ran 7 tests in 0.074s

FAILED (failures=1, skipped=2)
2018-06-10 01:25:32,923 - tests.cloud_tests - WARNING - test case: modules/set_password_expire failed TestPasswordExpire.test_no_warnings_in_log with: + ['2018-06-10 01:06:09,589 - util.py[WARNING]: No active metadata service found'] : 'WARN' found inside cloud-init.log
2018-06-10 01:25:32,923 - tests.cloud_tests - DEBUG - verifying test data for modules/ca_certs
test_cert_installed (tests.cloud_tests.testcases.modules.ca_certs.TestCaCerts)
Test line from our cert exists. ... ok
test_certs_updated (tests.cloud_tests.testcases.modules.ca_certs.TestCaCerts)
Test certs have been updated in /etc/ssl/certs. ... ok
test_instance_data_json_ec2 (tests.cloud_tests.testcases.modules.ca_certs.TestCaCerts)
Validate instance-data.json content by ec2 platform. ... ok
test_instance_data_json_kvm (tests.cloud_tests.testcases.modules.ca_certs.TestCaCerts)
Validate instance-data.json content by nocloud-kvm platform. ... skipped 'Skipping nocloud-kvm instance-data.json on ec2'
test_instance_data_json_lxd (tests.cloud_tests.testcases.modules.ca_certs.TestCaCerts)
Validate instance-data.json content by lxd platform. ... skipped 'Skipping lxd instance-data.json on ec2'
test_no_stages_errors (tests.cloud_tests.testcases.modules.ca_certs.TestCaCerts)
Ensure that there were no errors in any stage. ... ok
test_no_warnings_in_log (tests.cloud_tests.testcases.modules.ca_certs.TestCaCerts)
Unexpected warnings should not be found in the log. ... FAIL

======================================================================
FAIL: test_no_warnings_in_log (tests.cloud_tests.testcases.modules.ca_certs.TestCaCerts)
Unexpected warnings should not be found in the log.
----------------------------------------------------------------------
Traceback (most recent call last):
  File "/var/lib/jenkins/slaves/torkoal/workspace/cloud-init-integration-ec2-x/cloud-init/tests/cloud_tests/testcases/base.py", line 149, in test_no_warnings_in_log
    [], warnings, msg="'WARN' found inside cloud-init.log")
AssertionError: Lists differ: [] != ['2018-06-10 00:33:34,847 - util.py[WARNING]: No active metadata service found']

Second list contains 1 additional elements.
First extra element 0:
'2018-06-10 00:33:34,847 - util.py[WARNING]: No active metadata service found'

- []
+ ['2018-06-10 00:33:34,847 - util.py[WARNING]: No active metadata service found'] : 'WARN' found inside cloud-init.log

----------------------------------------------------------------------
Ran 7 tests in 0.054s

FAILED (failures=1, skipped=2)
2018-06-10 01:25:32,997 - tests.cloud_tests - WARNING - test case: modules/ca_certs failed TestCaCerts.test_no_warnings_in_log with: + ['2018-06-10 00:33:34,847 - util.py[WARNING]: No active metadata service found'] : 'WARN' found inside cloud-init.log
2018-06-10 01:25:32,997 - tests.cloud_tests - DEBUG - verifying test data for main/command_output_simple
test_instance_data_json_ec2 (tests.cloud_tests.testcases.main.command_output_simple.TestCommandOutputSimple)
Validate instance-data.json content by ec2 platform. ... ok
test_instance_data_json_kvm (tests.cloud_tests.testcases.main.command_output_simple.TestCommandOutputSimple)
Validate instance-data.json content by nocloud-kvm platform. ... skipped 'Skipping nocloud-kvm instance-data.json on ec2'
test_instance_data_json_lxd (tests.cloud_tests.testcases.main.command_output_simple.TestCommandOutputSimple)
Validate instance-data.json content by lxd platform. ... skipped 'Skipping lxd instance-data.json on ec2'
test_no_stages_errors (tests.cloud_tests.testcases.main.command_output_simple.TestCommandOutputSimple)
Ensure that there were no errors in any stage. ... ok
test_no_warnings_in_log (tests.cloud_tests.testcases.main.command_output_simple.TestCommandOutputSimple)
Unexpected warnings should not be found in the log. ... FAIL
test_output_file (tests.cloud_tests.testcases.main.command_output_simple.TestCommandOutputSimple)
Ensure that the output file is not empty and has all stages. ... ok

======================================================================
FAIL: test_no_warnings_in_log (tests.cloud_tests.testcases.main.command_output_simple.TestCommandOutputSimple)
Unexpected warnings should not be found in the log.
----------------------------------------------------------------------
Traceback (most recent call last):
  File "/var/lib/jenkins/slaves/torkoal/workspace/cloud-init-integration-ec2-x/cloud-init/tests/cloud_tests/testcases/base.py", line 149, in test_no_warnings_in_log
    [], warnings, msg="'WARN' found inside cloud-init.log")
AssertionError: Lists differ: [] != ['2018-06-10 00:10:27,680 - util.py[WARNING]: No active metadata service found']

Second list contains 1 additional elements.
First extra element 0:
'2018-06-10 00:10:27,680 - util.py[WARNING]: No active metadata service found'

- []
+ ['2018-06-10 00:10:27,680 - util.py[WARNING]: No active metadata service found'] : 'WARN' found inside cloud-init.log

----------------------------------------------------------------------
Ran 6 tests in 0.038s

FAILED (failures=1, skipped=2)
2018-06-10 01:25:33,043 - tests.cloud_tests - WARNING - test case: main/command_output_simple failed TestCommandOutputSimple.test_no_warnings_in_log with: + ['2018-06-10 00:10:27,680 - util.py[WARNING]: No active metadata service found'] : 'WARN' found inside cloud-init.log
2018-06-10 01:25:33,043 - tests.cloud_tests - WARNING - test: platform='ec2', os='xenial' failed 47 tests
2018-06-10 01:25:33,043 - tests.cloud_tests - DEBUG - verify results: {'ec2': {'xenial': {'modules/byobu': {'passed': False, 'failures': [{'error': "+ ['2018-06-10 00:31:50,975 - util.py[WARNING]: No active metadata service found'] : 'WARN' found inside cloud-init.log", 'class': 'TestByobu', 'module': 'tests.cloud_tests.testcases.modules.byobu', 'function': 'test_no_warnings_in_log', 'traceback': 'Traceback (most recent call last):\n  File "/var/lib/jenkins/slaves/torkoal/workspace/cloud-init-integration-ec2-x/cloud-init/tests/cloud_tests/testcases/base.py", line 149, in test_no_warnings_in_log\n    [], warnings, msg="\'WARN\' found inside cloud-init.log")\nAssertionError: Lists differ: [] != [\'2018-06-10 00:31:50,975 - util.py[WARNING]: No active metadata service found\']\n\nSecond list contains 1 additional elements.\nFirst extra element 0:\n\'2018-06-10 00:31:50,975 - util.py[WARNING]: No active metadata service found\'\n\n- []\n+ [\'2018-06-10 00:31:50,975 - util.py[WARNING]: No active metadata service found\'] : \'WARN\' found inside cloud-init.log\n'}]}, 'modules/ssh_keys_generate': {'passed': False, 'failures': [{'error': "+ ['2018-06-10 01:19:25,690 - util.py[WARNING]: No active metadata service found'] : 'WARN' found inside cloud-init.log", 'class': 'TestSshKeysGenerate', 'module': 'tests.cloud_tests.testcases.modules.ssh_keys_generate', 'function': 'test_no_warnings_in_log', 'traceback': 'Traceback (most recent call last):\n  File "/var/lib/jenkins/slaves/torkoal/workspace/cloud-init-integration-ec2-x/cloud-init/tests/cloud_tests/testcases/base.py", line 149, in test_no_warnings_in_log\n    [], warnings, msg="\'WARN\' found inside cloud-init.log")\nAssertionError: Lists differ: [] != [\'2018-06-10 01:19:25,690 - util.py[WARNING]: No active metadata service found\']\n\nSecond list contains 1 additional elements.\nFirst extra element 0:\n\'2018-06-10 01:19:25,690 - util.py[WARNING]: No active metadata service found\'\n\n- []\n+ [\'2018-06-10 01:19:25,690 - util.py[WARNING]: No active metadata service found\'] : \'WARN\' found inside cloud-init.log\n'}]}, 'modules/write_files': {'passed': False, 'failures': [{'error': "+ ['2018-06-10 01:24:01,540 - util.py[WARNING]: No active metadata service found'] : 'WARN' found inside cloud-init.log", 'class': 'TestWriteFiles', 'module': 'tests.cloud_tests.testcases.modules.write_files', 'function': 'test_no_warnings_in_log', 'traceback': 'Traceback (most recent call last):\n  File "/var/lib/jenkins/slaves/torkoal/workspace/cloud-init-integration-ec2-x/cloud-init/tests/cloud_tests/testcases/base.py", line 149, in test_no_warnings_in_log\n    [], warnings, msg="\'WARN\' found inside cloud-init.log")\nAssertionError: Lists differ: [] != [\'2018-06-10 01:24:01,540 - util.py[WARNING]: No active metadata service found\']\n\nSecond list contains 1 additional elements.\nFirst extra element 0:\n\'2018-06-10 01:24:01,540 - util.py[WARNING]: No active metadata service found\'\n\n- []\n+ [\'2018-06-10 01:24:01,540 - util.py[WARNING]: No active metadata service found\'] : \'WARN\' found inside cloud-init.log\n'}]}, 'modules/timezone': {'passed': False, 'failures': [{'error': "+ ['2018-06-10 01:20:46,948 - util.py[WARNING]: No active metadata service found'] : 'WARN' found inside cloud-init.log", 'class': 'TestTimezone', 'module': 'tests.cloud_tests.testcases.modules.timezone', 'function': 'test_no_warnings_in_log', 'traceback': 'Traceback (most recent call last):\n  File "/var/lib/jenkins/slaves/torkoal/workspace/cloud-init-integration-ec2-x/cloud-init/tests/cloud_tests/testcases/base.py", line 149, in test_no_warnings_in_log\n    [], warnings, msg="\'WARN\' found inside cloud-init.log")\nAssertionError: Lists differ: [] != [\'2018-06-10 01:20:46,948 - util.py[WARNING]: No active metadata service found\']\n\nSecond list contains 1 additional elements.\nFirst extra element 0:\n\'2018-06-10 01:20:46,948 - util.py[WARNING]: No active metadata service found\'\n\n- []\n+ [\'2018-06-10 01:20:46,948 - util.py[WARNING]: No active metadata service found\'] : \'WARN\' found inside cloud-init.log\n'}]}, 'modules/lxd_bridge': {'passed': False, 'failures': [{'error': "+ ['2018-06-10 00:42:30,634 - util.py[WARNING]: No active metadata service found'] : 'WARN' found inside cloud-init.log", 'class': 'TestLxdBridge', 'module': 'tests.cloud_tests.testcases.modules.lxd_bridge', 'function': 'test_no_warnings_in_log', 'traceback': 'Traceback (most recent call last):\n  File "/var/lib/jenkins/slaves/torkoal/workspace/cloud-init-integration-ec2-x/cloud-init/tests/cloud_tests/testcases/base.py", line 149, in test_no_warnings_in_log\n    [], warnings, msg="\'WARN\' found inside cloud-init.log")\nAssertionError: Lists differ: [] != [\'2018-06-10 00:42:30,634 - util.py[WARNING]: No active metadata service found\']\n\nSecond list contains 1 additional elements.\nFirst extra element 0:\n\'2018-06-10 00:42:30,634 - util.py[WARNING]: No active metadata service found\'\n\n- []\n+ [\'2018-06-10 00:42:30,634 - util.py[WARNING]: No active metadata service found\'] : \'WARN\' found inside cloud-init.log\n'}]}, 'modules/snap': {'passed': False, 'failures': [{'error': "+ ['2018-06-10 01:11:08,101 - util.py[WARNING]: No active metadata service found'] : 'WARN' found inside cloud-init.log", 'class': 'TestSnap', 'module': 'tests.cloud_tests.testcases.modules.snap', 'function': 'test_no_warnings_in_log', 'traceback': 'Traceback (most recent call last):\n  File "/var/lib/jenkins/slaves/torkoal/workspace/cloud-init-integration-ec2-x/cloud-init/tests/cloud_tests/testcases/base.py", line 149, in test_no_warnings_in_log\n    [], warnings, msg="\'WARN\' found inside cloud-init.log")\nAssertionError: Lists differ: [] != [\'2018-06-10 01:11:08,101 - util.py[WARNING]: No active metadata service found\']\n\nSecond list contains 1 additional elements.\nFirst extra element 0:\n\'2018-06-10 01:11:08,101 - util.py[WARNING]: No active metadata service found\'\n\n- []\n+ [\'2018-06-10 01:11:08,101 - util.py[WARNING]: No active metadata service found\'] : \'WARN\' found inside cloud-init.log\n'}]}, 'modules/snappy': {'passed': False, 'failures': [{'error': "+ ['2018-06-10 01:13:01,974 - util.py[WARNING]: No active metadata service found'] : 'WARN' found inside cloud-init.log", 'class': 'TestSnappy', 'module': 'tests.cloud_tests.testcases.modules.snappy', 'function': 'test_no_warnings_in_log', 'traceback': 'Traceback (most recent call last):\n  File "/var/lib/jenkins/slaves/torkoal/workspace/cloud-init-integration-ec2-x/cloud-init/tests/cloud_tests/testcases/base.py", line 149, in test_no_warnings_in_log\n    [], warnings, msg="\'WARN\' found inside cloud-init.log")\nAssertionError: Lists differ: [] != [\'2018-06-10 01:13:01,974 - util.py[WARNING]: No active metadata service found\']\n\nSecond list contains 1 additional elements.\nFirst extra element 0:\n\'2018-06-10 01:13:01,974 - util.py[WARNING]: No active metadata service found\'\n\n- []\n+ [\'2018-06-10 01:13:01,974 - util.py[WARNING]: No active metadata service found\'] : \'WARN\' found inside cloud-init.log\n'}]}, 'modules/ssh_auth_key_fingerprints_disable': {'passed': False, 'failures': [{'error': "+ ['2018-06-10 01:14:40,090 - util.py[WARNING]: No active metadata service found'] : 'WARN' found inside cloud-init.log", 'class': 'TestSshKeyFingerprintsDisable', 'module': 'tests.cloud_tests.testcases.modules.ssh_auth_key_fingerprints_disable', 'function': 'test_no_warnings_in_log', 'traceback': 'Traceback (most recent call last):\n  File "/var/lib/jenkins/slaves/torkoal/workspace/cloud-init-integration-ec2-x/cloud-init/tests/cloud_tests/testcases/base.py", line 149, in test_no_warnings_in_log\n    [], warnings, msg="\'WARN\' found inside cloud-init.log")\nAssertionError: Lists differ: [] != [\'2018-06-10 01:14:40,090 - util.py[WARNING]: No active metadata service found\']\n\nSecond list contains 1 additional elements.\nFirst extra element 0:\n\'2018-06-10 01:14:40,090 - util.py[WARNING]: No active metadata service found\'\n\n- []\n+ [\'2018-06-10 01:14:40,090 - util.py[WARNING]: No active metadata service found\'] : \'WARN\' found inside cloud-init.log\n'}]}, 'modules/package_update_upgrade_install': {'passed': False, 'failures': [{'error': "+ ['2018-06-10 00:54:40,345 - util.py[WARNING]: No active metadata service found'] : 'WARN' found inside cloud-init.log", 'class': 'TestPackageInstallUpdateUpgrade', 'module': 'tests.cloud_tests.testcases.modules.package_update_upgrade_install', 'function': 'test_no_warnings_in_log', 'traceback': 'Traceback (most recent call last):\n  File "/var/lib/jenkins/slaves/torkoal/workspace/cloud-init-integration-ec2-x/cloud-init/tests/cloud_tests/testcases/base.py", line 149, in test_no_warnings_in_log\n    [], warnings, msg="\'WARN\' found inside cloud-init.log")\nAssertionError: Lists differ: [] != [\'2018-06-10 00:54:40,345 - util.py[WARNING]: No active metadata service found\']\n\nSecond list contains 1 additional elements.\nFirst extra element 0:\n\'2018-06-10 00:54:40,345 - util.py[WARNING]: No active metadata service found\'\n\n- []\n+ [\'2018-06-10 00:54:40,345 - util.py[WARNING]: No active metadata service found\'] : \'WARN\' found inside cloud-init.log\n'}]}, 'modules/apt_pipelining_os': {'passed': False, 'failures': [{'error': "+ ['2018-06-10 00:28:37,787 - util.py[WARNING]: No active metadata service found'] : 'WARN' found inside cloud-init.log", 'class': 'TestAptPipeliningOS', 'module': 'tests.cloud_tests.testcases.modules.apt_pipelining_os', 'function': 'test_no_warnings_in_log', 'traceback': 'Traceback (most recent call last):\n  File "/var/lib/jenkins/slaves/torkoal/workspace/cloud-init-integration-ec2-x/cloud-init/tests/cloud_tests/testcases/base.py", line 149, in test_no_warnings_in_log\n    [], warnings, msg="\'WARN\' found inside cloud-init.log")\nAssertionError: Lists differ: [] != [\'2018-06-10 00:28:37,787 - util.py[WARNING]: No active metadata service found\']\n\nSecond list contains 1 additional elements.\nFirst extra element 0:\n\'2018-06-10 00:28:37,787 - util.py[WARNING]: No active metadata service found\'\n\n- []\n+ [\'2018-06-10 00:28:37,787 - util.py[WARNING]: No active metadata service found\'] : \'WARN\' found inside cloud-init.log\n'}]}, 'modules/ntp': {'passed': False, 'failures': [{'error': "+ ['2018-06-10 00:45:55,743 - util.py[WARNING]: No active metadata service found'] : 'WARN' found inside cloud-init.log", 'class': 'TestNtp', 'module': 'tests.cloud_tests.testcases.modules.ntp', 'function': 'test_no_warnings_in_log', 'traceback': 'Traceback (most recent call last):\n  File "/var/lib/jenkins/slaves/torkoal/workspace/cloud-init-integration-ec2-x/cloud-init/tests/cloud_tests/testcases/base.py", line 149, in test_no_warnings_in_log\n    [], warnings, msg="\'WARN\' found inside cloud-init.log")\nAssertionError: Lists differ: [] != [\'2018-06-10 00:45:55,743 - util.py[WARNING]: No active metadata service found\']\n\nSecond list contains 1 additional elements.\nFirst extra element 0:\n\'2018-06-10 00:45:55,743 - util.py[WARNING]: No active metadata service found\'\n\n- []\n+ [\'2018-06-10 00:45:55,743 - util.py[WARNING]: No active metadata service found\'] : \'WARN\' found inside cloud-init.log\n'}]}, 'modules/lxd_dir': {'passed': False, 'failures': [{'error': "+ ['2018-06-10 00:44:18,706 - util.py[WARNING]: No active metadata service found'] : 'WARN' found inside cloud-init.log", 'class': 'TestLxdDir', 'module': 'tests.cloud_tests.testcases.modules.lxd_dir', 'function': 'test_no_warnings_in_log', 'traceback': 'Traceback (most recent call last):\n  File "/var/lib/jenkins/slaves/torkoal/workspace/cloud-init-integration-ec2-x/cloud-init/tests/cloud_tests/testcases/base.py", line 149, in test_no_warnings_in_log\n    [], warnings, msg="\'WARN\' found inside cloud-init.log")\nAssertionError: Lists differ: [] != [\'2018-06-10 00:44:18,706 - util.py[WARNING]: No active metadata service found\']\n\nSecond list contains 1 additional elements.\nFirst extra element 0:\n\'2018-06-10 00:44:18,706 - util.py[WARNING]: No active metadata service found\'\n\n- []\n+ [\'2018-06-10 00:44:18,706 - util.py[WARNING]: No active metadata service found\'] : \'WARN\' found inside cloud-init.log\n'}]}, 'modules/set_password_expire': {'passed': False, 'failures': [{'error': "+ ['2018-06-10 01:06:09,589 - util.py[WARNING]: No active metadata service found'] : 'WARN' found inside cloud-init.log", 'class': 'TestPasswordExpire', 'module': 'tests.cloud_tests.testcases.modules.set_password_expire', 'function': 'test_no_warnings_in_log', 'traceback': 'Traceback (most recent call last):\n  File "/var/lib/jenkins/slaves/torkoal/workspace/cloud-init-integration-ec2-x/cloud-init/tests/cloud_tests/testcases/base.py", line 149, in test_no_warnings_in_log\n    [], warnings, msg="\'WARN\' found inside cloud-init.log")\nAssertionError: Lists differ: [] != [\'2018-06-10 01:06:09,589 - util.py[WARNING]: No active metadata service found\']\n\nSecond list contains 1 additional elements.\nFirst extra element 0:\n\'2018-06-10 01:06:09,589 - util.py[WARNING]: No active metadata service found\'\n\n- []\n+ [\'2018-06-10 01:06:09,589 - util.py[WARNING]: No active metadata service found\'] : \'WARN\' found inside cloud-init.log\n'}]}, 'modules/ssh_auth_key_fingerprints_enable': {'passed': False, 'failures': [{'error': "+ ['2018-06-10 01:16:16,907 - util.py[WARNING]: No active metadata service found'] : 'WARN' found inside cloud-init.log", 'class': 'TestSshKeyFingerprintsEnable', 'module': 'tests.cloud_tests.testcases.modules.ssh_auth_key_fingerprints_enable', 'function': 'test_no_warnings_in_log', 'traceback': 'Traceback (most recent call last):\n  File "/var/lib/jenkins/slaves/torkoal/workspace/cloud-init-integration-ec2-x/cloud-init/tests/cloud_tests/testcases/base.py", line 149, in test_no_warnings_in_log\n    [], warnings, msg="\'WARN\' found inside cloud-init.log")\nAssertionError: Lists differ: [] != [\'2018-06-10 01:16:16,907 - util.py[WARNING]: No active metadata service found\']\n\nSecond list contains 1 additional elements.\nFirst extra element 0:\n\'2018-06-10 01:16:16,907 - util.py[WARNING]: No active metadata service found\'\n\n- []\n+ [\'2018-06-10 01:16:16,907 - util.py[WARNING]: No active metadata service found\'] : \'WARN\' found inside cloud-init.log\n'}]}, 'modules/seed_random_data': {'passed': False, 'failures': [{'error': "+ ['2018-06-10 01:00:00,412 - util.py[WARNING]: No active metadata service found'] : 'WARN' found inside cloud-init.log", 'class': 'TestSeedRandom', 'module': 'tests.cloud_tests.testcases.modules.seed_random_data', 'function': 'test_no_warnings_in_log', 'traceback': 'Traceback (most recent call last):\n  File "/var/lib/jenkins/slaves/torkoal/workspace/cloud-init-integration-ec2-x/cloud-init/tests/cloud_tests/testcases/base.py", line 149, in test_no_warnings_in_log\n    [], warnings, msg="\'WARN\' found inside cloud-init.log")\nAssertionError: Lists differ: [] != [\'2018-06-10 01:00:00,412 - util.py[WARNING]: No active metadata service found\']\n\nSecond list contains 1 additional elements.\nFirst extra element 0:\n\'2018-06-10 01:00:00,412 - util.py[WARNING]: No active metadata service found\'\n\n- []\n+ [\'2018-06-10 01:00:00,412 - util.py[WARNING]: No active metadata service found\'] : \'WARN\' found inside cloud-init.log\n'}]}, 'modules/apt_configure_sources_list': {'passed': False, 'failures': [{'error': "+ ['2018-06-10 00:23:33,875 - util.py[WARNING]: No active metadata service found'] : 'WARN' found inside cloud-init.log", 'class': 'TestAptconfigureSourcesList', 'module': 'tests.cloud_tests.testcases.modules.apt_configure_sources_list', 'function': 'test_no_warnings_in_log', 'traceback': 'Traceback (most recent call last):\n  File "/var/lib/jenkins/slaves/torkoal/workspace/cloud-init-integration-ec2-x/cloud-init/tests/cloud_tests/testcases/base.py", line 149, in test_no_warnings_in_log\n    [], warnings, msg="\'WARN\' found inside cloud-init.log")\nAssertionError: Lists differ: [] != [\'2018-06-10 00:23:33,875 - util.py[WARNING]: No active metadata service found\']\n\nSecond list contains 1 additional elements.\nFirst extra element 0:\n\'2018-06-10 00:23:33,875 - util.py[WARNING]: No active metadata service found\'\n\n- []\n+ [\'2018-06-10 00:23:33,875 - util.py[WARNING]: No active metadata service found\'] : \'WARN\' found inside cloud-init.log\n'}]}, 'main/command_output_simple': {'passed': False, 'failures': [{'error': "+ ['2018-06-10 00:10:27,680 - util.py[WARNING]: No active metadata service found'] : 'WARN' found inside cloud-init.log", 'class': 'TestCommandOutputSimple', 'module': 'tests.cloud_tests.testcases.main.command_output_simple', 'function': 'test_no_warnings_in_log', 'traceback': 'Traceback (most recent call last):\n  File "/var/lib/jenkins/slaves/torkoal/workspace/cloud-init-integration-ec2-x/cloud-init/tests/cloud_tests/testcases/base.py", line 149, in test_no_warnings_in_log\n    [], warnings, msg="\'WARN\' found inside cloud-init.log")\nAssertionError: Lists differ: [] != [\'2018-06-10 00:10:27,680 - util.py[WARNING]: No active metadata service found\']\n\nSecond list contains 1 additional elements.\nFirst extra element 0:\n\'2018-06-10 00:10:27,680 - util.py[WARNING]: No active metadata service found\'\n\n- []\n+ [\'2018-06-10 00:10:27,680 - util.py[WARNING]: No active metadata service found\'] : \'WARN\' found inside cloud-init.log\n'}]}, 'modules/ssh_import_id': {'passed': False, 'failures': [{'error': "+ ['2018-06-10 01:17:52,552 - util.py[WARNING]: No active metadata service found'] : 'WARN' found inside cloud-init.log", 'class': 'TestSshImportId', 'module': 'tests.cloud_tests.testcases.modules.ssh_import_id', 'function': 'test_no_warnings_in_log', 'traceback': 'Traceback (most recent call last):\n  File "/var/lib/jenkins/slaves/torkoal/workspace/cloud-init-integration-ec2-x/cloud-init/tests/cloud_tests/testcases/base.py", line 149, in test_no_warnings_in_log\n    [], warnings, msg="\'WARN\' found inside cloud-init.log")\nAssertionError: Lists differ: [] != [\'2018-06-10 01:17:52,552 - util.py[WARNING]: No active metadata service found\']\n\nSecond list contains 1 additional elements.\nFirst extra element 0:\n\'2018-06-10 01:17:52,552 - util.py[WARNING]: No active metadata service found\'\n\n- []\n+ [\'2018-06-10 01:17:52,552 - util.py[WARNING]: No active metadata service found\'] : \'WARN\' found inside cloud-init.log\n'}]}, 'modules/apt_configure_sources_ppa': {'passed': False, 'failures': [{'error': "+ ['2018-06-10 00:25:13,785 - util.py[WARNING]: No active metadata service found'] : 'WARN' found inside cloud-init.log", 'class': 'TestAptconfigureSourcesPPA', 'module': 'tests.cloud_tests.testcases.modules.apt_configure_sources_ppa', 'function': 'test_no_warnings_in_log', 'traceback': 'Traceback (most recent call last):\n  File "/var/lib/jenkins/slaves/torkoal/workspace/cloud-init-integration-ec2-x/cloud-init/tests/cloud_tests/testcases/base.py", line 149, in test_no_warnings_in_log\n    [], warnings, msg="\'WARN\' found inside cloud-init.log")\nAssertionError: Lists differ: [] != [\'2018-06-10 00:25:13,785 - util.py[WARNING]: No active metadata service found\']\n\nSecond list contains 1 additional elements.\nFirst extra element 0:\n\'2018-06-10 00:25:13,785 - util.py[WARNING]: No active metadata service found\'\n\n- []\n+ [\'2018-06-10 00:25:13,785 - util.py[WARNING]: No active metadata service found\'] : \'WARN\' found inside cloud-init.log\n'}]}, 'modules/apt_configure_conf': {'passed': False, 'failures': [{'error': "+ ['2018-06-10 00:12:02,792 - util.py[WARNING]: No active metadata service found'] : 'WARN' found inside cloud-init.log", 'class': 'TestAptconfigureConf', 'module': 'tests.cloud_tests.testcases.modules.apt_configure_conf', 'function': 'test_no_warnings_in_log', 'traceback': 'Traceback (most recent call last):\n  File "/var/lib/jenkins/slaves/torkoal/workspace/cloud-init-integration-ec2-x/cloud-init/tests/cloud_tests/testcases/base.py", line 149, in test_no_warnings_in_log\n    [], warnings, msg="\'WARN\' found inside cloud-init.log")\nAssertionError: Lists differ: [] != [\'2018-06-10 00:12:02,792 - util.py[WARNING]: No active metadata service found\']\n\nSecond list contains 1 additional elements.\nFirst extra element 0:\n\'2018-06-10 00:12:02,792 - util.py[WARNING]: No active metadata service found\'\n\n- []\n+ [\'2018-06-10 00:12:02,792 - util.py[WARNING]: No active metadata service found\'] : \'WARN\' found inside cloud-init.log\n'}]}, 'modules/apt_configure_proxy': {'passed': False, 'failures': [{'error': "+ ['2018-06-10 00:16:55,189 - util.py[WARNING]: No active metadata service found'] : 'WARN' found inside cloud-init.log", 'class': 'TestAptconfigureProxy', 'module': 'tests.cloud_tests.testcases.modules.apt_configure_proxy', 'function': 'test_no_warnings_in_log', 'traceback': 'Traceback (most recent call last):\n  File "/var/lib/jenkins/slaves/torkoal/workspace/cloud-init-integration-ec2-x/cloud-init/tests/cloud_tests/testcases/base.py", line 149, in test_no_warnings_in_log\n    [], warnings, msg="\'WARN\' found inside cloud-init.log")\nAssertionError: Lists differ: [] != [\'2018-06-10 00:16:55,189 - util.py[WARNING]: No active metadata service found\']\n\nSecond list contains 1 additional elements.\nFirst extra element 0:\n\'2018-06-10 00:16:55,189 - util.py[WARNING]: No active metadata service found\'\n\n- []\n+ [\'2018-06-10 00:16:55,189 - util.py[WARNING]: No active metadata service found\'] : \'WARN\' found inside cloud-init.log\n'}]}, 'modules/ntp_pools': {'passed': False, 'failures': [{'error': "+ ['2018-06-10 00:49:33,819 - util.py[WARNING]: No active metadata service found'] : 'WARN' found inside cloud-init.log", 'class': 'TestNtpPools', 'module': 'tests.cloud_tests.testcases.modules.ntp_pools', 'function': 'test_no_warnings_in_log', 'traceback': 'Traceback (most recent call last):\n  File "/var/lib/jenkins/slaves/torkoal/workspace/cloud-init-integration-ec2-x/cloud-init/tests/cloud_tests/testcases/base.py", line 149, in test_no_warnings_in_log\n    [], warnings, msg="\'WARN\' found inside cloud-init.log")\nAssertionError: Lists differ: [] != [\'2018-06-10 00:49:33,819 - util.py[WARNING]: No active metadata service found\']\n\nSecond list contains 1 additional elements.\nFirst extra element 0:\n\'2018-06-10 00:49:33,819 - util.py[WARNING]: No active metadata service found\'\n\n- []\n+ [\'2018-06-10 00:49:33,819 - util.py[WARNING]: No active metadata service found\'] : \'WARN\' found inside cloud-init.log\n'}]}, 'modules/apt_configure_security': {'passed': False, 'failures': [{'error': "+ ['2018-06-10 00:18:32,616 - util.py[WARNING]: No active metadata service found'] : 'WARN' found inside cloud-init.log", 'class': 'TestAptconfigureSecurity', 'module': 'tests.cloud_tests.testcases.modules.apt_configure_security', 'function': 'test_no_warnings_in_log', 'traceback': 'Traceback (most recent call last):\n  File "/var/lib/jenkins/slaves/torkoal/workspace/cloud-init-integration-ec2-x/cloud-init/tests/cloud_tests/testcases/base.py", line 149, in test_no_warnings_in_log\n    [], warnings, msg="\'WARN\' found inside cloud-init.log")\nAssertionError: Lists differ: [] != [\'2018-06-10 00:18:32,616 - util.py[WARNING]: No active metadata service found\']\n\nSecond list contains 1 additional elements.\nFirst extra element 0:\n\'2018-06-10 00:18:32,616 - util.py[WARNING]: No active metadata service found\'\n\n- []\n+ [\'2018-06-10 00:18:32,616 - util.py[WARNING]: No active metadata service found\'] : \'WARN\' found inside cloud-init.log\n'}]}, 'bugs/lp1628337': {'passed': False, 'failures': [{'error': "+ ['2018-06-10 00:08:41,891 - util.py[WARNING]: No active metadata service found'] : 'WARN' found inside cloud-init.log", 'class': 'TestLP1628337', 'module': 'tests.cloud_tests.testcases.bugs.lp1628337', 'function': 'test_no_warnings_in_log', 'traceback': 'Traceback (most recent call last):\n  File "/var/lib/jenkins/slaves/torkoal/workspace/cloud-init-integration-ec2-x/cloud-init/tests/cloud_tests/testcases/base.py", line 149, in test_no_warnings_in_log\n    [], warnings, msg="\'WARN\' found inside cloud-init.log")\nAssertionError: Lists differ: [] != [\'2018-06-10 00:08:41,891 - util.py[WARNING]: No active metadata service found\']\n\nSecond list contains 1 additional elements.\nFirst extra element 0:\n\'2018-06-10 00:08:41,891 - util.py[WARNING]: No active metadata service found\'\n\n- []\n+ [\'2018-06-10 00:08:41,891 - util.py[WARNING]: No active metadata service found\'] : \'WARN\' found inside cloud-init.log\n'}]}, 'modules/debug_enable': {'passed': False, 'failures': [{'error': "+ ['2018-06-10 00:36:38,414 - util.py[WARNING]: No active metadata service found'] : 'WARN' found inside cloud-init.log", 'class': 'TestDebugEnable', 'module': 'tests.cloud_tests.testcases.modules.debug_enable', 'function': 'test_no_warnings_in_log', 'traceback': 'Traceback (most recent call last):\n  File "/var/lib/jenkins/slaves/torkoal/workspace/cloud-init-integration-ec2-x/cloud-init/tests/cloud_tests/testcases/base.py", line 149, in test_no_warnings_in_log\n    [], warnings, msg="\'WARN\' found inside cloud-init.log")\nAssertionError: Lists differ: [] != [\'2018-06-10 00:36:38,414 - util.py[WARNING]: No active metadata service found\']\n\nSecond list contains 1 additional elements.\nFirst extra element 0:\n\'2018-06-10 00:36:38,414 - util.py[WARNING]: No active metadata service found\'\n\n- []\n+ [\'2018-06-10 00:36:38,414 - util.py[WARNING]: No active metadata service found\'] : \'WARN\' found inside cloud-init.log\n'}]}, 'modules/apt_configure_sources_keyserver': {'passed': False, 'failures': [{'error': "+ ['2018-06-10 00:21:52,774 - util.py[WARNING]: No active metadata service found'] : 'WARN' found inside cloud-init.log", 'class': 'TestAptconfigureSourcesKeyserver', 'module': 'tests.cloud_tests.testcases.modules.apt_configure_sources_keyserver', 'function': 'test_no_warnings_in_log', 'traceback': 'Traceback (most recent call last):\n  File "/var/lib/jenkins/slaves/torkoal/workspace/cloud-init-integration-ec2-x/cloud-init/tests/cloud_tests/testcases/base.py", line 149, in test_no_warnings_in_log\n    [], warnings, msg="\'WARN\' found inside cloud-init.log")\nAssertionError: Lists differ: [] != [\'2018-06-10 00:21:52,774 - util.py[WARNING]: No active metadata service found\']\n\nSecond list contains 1 additional elements.\nFirst extra element 0:\n\'2018-06-10 00:21:52,774 - util.py[WARNING]: No active metadata service found\'\n\n- []\n+ [\'2018-06-10 00:21:52,774 - util.py[WARNING]: No active metadata service found\'] : \'WARN\' found inside cloud-init.log\n'}]}, 'modules/salt_minion': {'passed': False, 'failures': [{'error': "+ ['2018-06-10 00:58:03,905 - util.py[WARNING]: No active metadata service found'] : 'WARN' found inside cloud-init.log", 'class': 'Test', 'module': 'tests.cloud_tests.testcases.modules.salt_minion', 'function': 'test_no_warnings_in_log', 'traceback': 'Traceback (most recent call last):\n  File "/var/lib/jenkins/slaves/torkoal/workspace/cloud-init-integration-ec2-x/cloud-init/tests/cloud_tests/testcases/base.py", line 149, in test_no_warnings_in_log\n    [], warnings, msg="\'WARN\' found inside cloud-init.log")\nAssertionError: Lists differ: [] != [\'2018-06-10 00:58:03,905 - util.py[WARNING]: No active metadata service found\']\n\nSecond list contains 1 additional elements.\nFirst extra element 0:\n\'2018-06-10 00:58:03,905 - util.py[WARNING]: No active metadata service found\'\n\n- []\n+ [\'2018-06-10 00:58:03,905 - util.py[WARNING]: No active metadata service found\'] : \'WARN\' found inside cloud-init.log\n'}]}, 'modules/locale': {'passed': False, 'failures': [{'error': "+ ['2018-06-10 00:40:53,279 - util.py[WARNING]: No active metadata service found'] : 'WARN' found inside cloud-init.log", 'class': 'TestLocale', 'module': 'tests.cloud_tests.testcases.modules.locale', 'function': 'test_no_warnings_in_log', 'traceback': 'Traceback (most recent call last):\n  File "/var/lib/jenkins/slaves/torkoal/workspace/cloud-init-integration-ec2-x/cloud-init/tests/cloud_tests/testcases/base.py", line 149, in test_no_warnings_in_log\n    [], warnings, msg="\'WARN\' found inside cloud-init.log")\nAssertionError: Lists differ: [] != [\'2018-06-10 00:40:53,279 - util.py[WARNING]: No active metadata service found\']\n\nSecond list contains 1 additional elements.\nFirst extra element 0:\n\'2018-06-10 00:40:53,279 - util.py[WARNING]: No active metadata service found\'\n\n- []\n+ [\'2018-06-10 00:40:53,279 - util.py[WARNING]: No active metadata service found\'] : \'WARN\' found inside cloud-init.log\n'}]}, 'modules/set_password_list': {'passed': False, 'failures': [{'error': "+ ['2018-06-10 01:07:45,804 - util.py[WARNING]: No active metadata service found'] : 'WARN' found inside cloud-init.log", 'class': 'TestPasswordList', 'module': 'tests.cloud_tests.testcases.modules.set_password_list', 'function': 'test_no_warnings_in_log', 'traceback': 'Traceback (most recent call last):\n  File "/var/lib/jenkins/slaves/torkoal/workspace/cloud-init-integration-ec2-x/cloud-init/tests/cloud_tests/testcases/base.py", line 149, in test_no_warnings_in_log\n    [], warnings, msg="\'WARN\' found inside cloud-init.log")\nAssertionError: Lists differ: [] != [\'2018-06-10 01:07:45,804 - util.py[WARNING]: No active metadata service found\']\n\nSecond list contains 1 additional elements.\nFirst extra element 0:\n\'2018-06-10 01:07:45,804 - util.py[WARNING]: No active metadata service found\'\n\n- []\n+ [\'2018-06-10 01:07:45,804 - util.py[WARNING]: No active metadata service found\'] : \'WARN\' found inside cloud-init.log\n'}]}, 'modules/set_password_list_string': {'passed': False, 'failures': [{'error': "+ ['2018-06-10 01:09:33,232 - util.py[WARNING]: No active metadata service found'] : 'WARN' found inside cloud-init.log", 'class': 'TestPasswordListString', 'module': 'tests.cloud_tests.testcases.modules.set_password_list_string', 'function': 'test_no_warnings_in_log', 'traceback': 'Traceback (most recent call last):\n  File "/var/lib/jenkins/slaves/torkoal/workspace/cloud-init-integration-ec2-x/cloud-init/tests/cloud_tests/testcases/base.py", line 149, in test_no_warnings_in_log\n    [], warnings, msg="\'WARN\' found inside cloud-init.log")\nAssertionError: Lists differ: [] != [\'2018-06-10 01:09:33,232 - util.py[WARNING]: No active metadata service found\']\n\nSecond list contains 1 additional elements.\nFirst extra element 0:\n\'2018-06-10 01:09:33,232 - util.py[WARNING]: No active metadata service found\'\n\n- []\n+ [\'2018-06-10 01:09:33,232 - util.py[WARNING]: No active metadata service found\'] : \'WARN\' found inside cloud-init.log\n'}]}, 'modules/ca_certs': {'passed': False, 'failures': [{'error': "+ ['2018-06-10 00:33:34,847 - util.py[WARNING]: No active metadata service found'] : 'WARN' found inside cloud-init.log", 'class': 'TestCaCerts', 'module': 'tests.cloud_tests.testcases.modules.ca_certs', 'function': 'test_no_warnings_in_log', 'traceback': 'Traceback (most recent call last):\n  File "/var/lib/jenkins/slaves/torkoal/workspace/cloud-init-integration-ec2-x/cloud-init/tests/cloud_tests/testcases/base.py", line 149, in test_no_warnings_in_log\n    [], warnings, msg="\'WARN\' found inside cloud-init.log")\nAssertionError: Lists differ: [] != [\'2018-06-10 00:33:34,847 - util.py[WARNING]: No active metadata service found\']\n\nSecond list contains 1 additional elements.\nFirst extra element 0:\n\'2018-06-10 00:33:34,847 - util.py[WARNING]: No active metadata service found\'\n\n- []\n+ [\'2018-06-10 00:33:34,847 - util.py[WARNING]: No active metadata service found\'] : \'WARN\' found inside cloud-init.log\n'}]}, 'modules/ntp_servers': {'passed': False, 'failures': [{'error': "+ ['2018-06-10 00:51:20,106 - util.py[WARNING]: No active metadata service found'] : 'WARN' found inside cloud-init.log", 'class': 'TestNtpServers', 'module': 'tests.cloud_tests.testcases.modules.ntp_servers', 'function': 'test_no_warnings_in_log', 'traceback': 'Traceback (most recent call last):\n  File "/var/lib/jenkins/slaves/torkoal/workspace/cloud-init-integration-ec2-x/cloud-init/tests/cloud_tests/testcases/base.py", line 149, in test_no_warnings_in_log\n    [], warnings, msg="\'WARN\' found inside cloud-init.log")\nAssertionError: Lists differ: [] != [\'2018-06-10 00:51:20,106 - util.py[WARNING]: No active metadata service found\']\n\nSecond list contains 1 additional elements.\nFirst extra element 0:\n\'2018-06-10 00:51:20,106 - util.py[WARNING]: No active metadata service found\'\n\n- []\n+ [\'2018-06-10 00:51:20,106 - util.py[WARNING]: No active metadata service found\'] : \'WARN\' found inside cloud-init.log\n'}]}, 'modules/ntp_timesyncd': {'passed': False, 'failures': [{'error': "+ ['2018-06-10 00:53:04,275 - util.py[WARNING]: No active metadata service found'] : 'WARN' found inside cloud-init.log", 'class': 'TestNtpTimesyncd', 'module': 'tests.cloud_tests.testcases.modules.ntp_timesyncd', 'function': 'test_no_warnings_in_log', 'traceback': 'Traceback (most recent call last):\n  File "/var/lib/jenkins/slaves/torkoal/workspace/cloud-init-integration-ec2-x/cloud-init/tests/cloud_tests/testcases/base.py", line 149, in test_no_warnings_in_log\n    [], warnings, msg="\'WARN\' found inside cloud-init.log")\nAssertionError: Lists differ: [] != [\'2018-06-10 00:53:04,275 - util.py[WARNING]: No active metadata service found\']\n\nSecond list contains 1 additional elements.\nFirst extra element 0:\n\'2018-06-10 00:53:04,275 - util.py[WARNING]: No active metadata service found\'\n\n- []\n+ [\'2018-06-10 00:53:04,275 - util.py[WARNING]: No active metadata service found\'] : \'WARN\' found inside cloud-init.log\n'}]}, 'modules/set_password': {'passed': False, 'failures': [{'error': "+ ['2018-06-10 01:04:35,932 - util.py[WARNING]: No active metadata service found'] : 'WARN' found inside cloud-init.log", 'class': 'TestPassword', 'module': 'tests.cloud_tests.testcases.modules.set_password', 'function': 'test_no_warnings_in_log', 'traceback': 'Traceback (most recent call last):\n  File "/var/lib/jenkins/slaves/torkoal/workspace/cloud-init-integration-ec2-x/cloud-init/tests/cloud_tests/testcases/base.py", line 149, in test_no_warnings_in_log\n    [], warnings, msg="\'WARN\' found inside cloud-init.log")\nAssertionError: Lists differ: [] != [\'2018-06-10 01:04:35,932 - util.py[WARNING]: No active metadata service found\']\n\nSecond list contains 1 additional elements.\nFirst extra element 0:\n\'2018-06-10 01:04:35,932 - util.py[WARNING]: No active metadata service found\'\n\n- []\n+ [\'2018-06-10 01:04:35,932 - util.py[WARNING]: No active metadata service found\'] : \'WARN\' found inside cloud-init.log\n'}]}, 'modules/apt_configure_primary': {'passed': False, 'failures': [{'error': "+ ['2018-06-10 00:15:19,635 - util.py[WARNING]: No active metadata service found'] : 'WARN' found inside cloud-init.log", 'class': 'TestAptconfigurePrimary', 'module': 'tests.cloud_tests.testcases.modules.apt_configure_primary', 'function': 'test_no_warnings_in_log', 'traceback': 'Traceback (most recent call last):\n  File "/var/lib/jenkins/slaves/torkoal/workspace/cloud-init-integration-ec2-x/cloud-init/tests/cloud_tests/testcases/base.py", line 149, in test_no_warnings_in_log\n    [], warnings, msg="\'WARN\' found inside cloud-init.log")\nAssertionError: Lists differ: [] != [\'2018-06-10 00:15:19,635 - util.py[WARNING]: No active metadata service found\']\n\nSecond list contains 1 additional elements.\nFirst extra element 0:\n\'2018-06-10 00:15:19,635 - util.py[WARNING]: No active metadata service found\'\n\n- []\n+ [\'2018-06-10 00:15:19,635 - util.py[WARNING]: No active metadata service found\'] : \'WARN\' found inside cloud-init.log\n'}]}, 'modules/debug_disable': {'passed': False, 'failures': [{'error': "+ ['2018-06-10 00:35:12,183 - util.py[WARNING]: No active metadata service found'] : 'WARN' found inside cloud-init.log", 'class': 'TestDebugDisable', 'module': 'tests.cloud_tests.testcases.modules.debug_disable', 'function': 'test_no_warnings_in_log', 'traceback': 'Traceback (most recent call last):\n  File "/var/lib/jenkins/slaves/torkoal/workspace/cloud-init-integration-ec2-x/cloud-init/tests/cloud_tests/testcases/base.py", line 149, in test_no_warnings_in_log\n    [], warnings, msg="\'WARN\' found inside cloud-init.log")\nAssertionError: Lists differ: [] != [\'2018-06-10 00:35:12,183 - util.py[WARNING]: No active metadata service found\']\n\nSecond list contains 1 additional elements.\nFirst extra element 0:\n\'2018-06-10 00:35:12,183 - util.py[WARNING]: No active metadata service found\'\n\n- []\n+ [\'2018-06-10 00:35:12,183 - util.py[WARNING]: No active metadata service found\'] : \'WARN\' found inside cloud-init.log\n'}]}, 'modules/bootcmd': {'passed': False, 'failures': [{'error': "+ ['2018-06-10 00:30:14,788 - util.py[WARNING]: No active metadata service found'] : 'WARN' found inside cloud-init.log", 'class': 'TestBootCmd', 'module': 'tests.cloud_tests.testcases.modules.bootcmd', 'function': 'test_no_warnings_in_log', 'traceback': 'Traceback (most recent call last):\n  File "/var/lib/jenkins/slaves/torkoal/workspace/cloud-init-integration-ec2-x/cloud-init/tests/cloud_tests/testcases/base.py", line 149, in test_no_warnings_in_log\n    [], warnings, msg="\'WARN\' found inside cloud-init.log")\nAssertionError: Lists differ: [] != [\'2018-06-10 00:30:14,788 - util.py[WARNING]: No active metadata service found\']\n\nSecond list contains 1 additional elements.\nFirst extra element 0:\n\'2018-06-10 00:30:14,788 - util.py[WARNING]: No active metadata service found\'\n\n- []\n+ [\'2018-06-10 00:30:14,788 - util.py[WARNING]: No active metadata service found\'] : \'WARN\' found inside cloud-init.log\n'}]}, 'modules/apt_configure_sources_key': {'passed': False, 'failures': [{'error': "+ ['2018-06-10 00:20:10,289 - util.py[WARNING]: No active metadata service found'] : 'WARN' found inside cloud-init.log", 'class': 'TestAptconfigureSourcesKey', 'module': 'tests.cloud_tests.testcases.modules.apt_configure_sources_key', 'function': 'test_no_warnings_in_log', 'traceback': 'Traceback (most recent call last):\n  File "/var/lib/jenkins/slaves/torkoal/workspace/cloud-init-integration-ec2-x/cloud-init/tests/cloud_tests/testcases/base.py", line 149, in test_no_warnings_in_log\n    [], warnings, msg="\'WARN\' found inside cloud-init.log")\nAssertionError: Lists differ: [] != [\'2018-06-10 00:20:10,289 - util.py[WARNING]: No active metadata service found\']\n\nSecond list contains 1 additional elements.\nFirst extra element 0:\n\'2018-06-10 00:20:10,289 - util.py[WARNING]: No active metadata service found\'\n\n- []\n+ [\'2018-06-10 00:20:10,289 - util.py[WARNING]: No active metadata service found\'] : \'WARN\' found inside cloud-init.log\n'}]}, 'modules/user_groups': {'passed': False, 'failures': [{'error': "+ ['2018-06-10 01:22:21,450 - util.py[WARNING]: No active metadata service found'] : 'WARN' found inside cloud-init.log", 'class': 'TestUserGroups', 'module': 'tests.cloud_tests.testcases.modules.user_groups', 'function': 'test_no_warnings_in_log', 'traceback': 'Traceback (most recent call last):\n  File "/var/lib/jenkins/slaves/torkoal/workspace/cloud-init-integration-ec2-x/cloud-init/tests/cloud_tests/testcases/base.py", line 149, in test_no_warnings_in_log\n    [], warnings, msg="\'WARN\' found inside cloud-init.log")\nAssertionError: Lists differ: [] != [\'2018-06-10 01:22:21,450 - util.py[WARNING]: No active metadata service found\']\n\nSecond list contains 1 additional elements.\nFirst extra element 0:\n\'2018-06-10 01:22:21,450 - util.py[WARNING]: No active metadata service found\'\n\n- []\n+ [\'2018-06-10 01:22:21,450 - util.py[WARNING]: No active metadata service found\'] : \'WARN\' found inside cloud-init.log\n'}]}, 'modules/keys_to_console': {'passed': False, 'failures': [{'error': "+ ['2018-06-10 00:39:19,043 - util.py[WARNING]: No active metadata service found'] : 'WARN' found inside cloud-init.log", 'class': 'TestKeysToConsole', 'module': 'tests.cloud_tests.testcases.modules.keys_to_console', 'function': 'test_no_warnings_in_log', 'traceback': 'Traceback (most recent call last):\n  File "/var/lib/jenkins/slaves/torkoal/workspace/cloud-init-integration-ec2-x/cloud-init/tests/cloud_tests/testcases/base.py", line 149, in test_no_warnings_in_log\n    [], warnings, msg="\'WARN\' found inside cloud-init.log")\nAssertionError: Lists differ: [] != [\'2018-06-10 00:39:19,043 - util.py[WARNING]: No active metadata service found\']\n\nSecond list contains 1 additional elements.\nFirst extra element 0:\n\'2018-06-10 00:39:19,043 - util.py[WARNING]: No active metadata service found\'\n\n- []\n+ [\'2018-06-10 00:39:19,043 - util.py[WARNING]: No active metadata service found\'] : \'WARN\' found inside cloud-init.log\n'}]}, 'modules/set_hostname_fqdn': {'passed': False, 'failures': [{'error': "+ ['2018-06-10 01:03:13,995 - util.py[WARNING]: No active metadata service found'] : 'WARN' found inside cloud-init.log", 'class': 'TestHostnameFqdn', 'module': 'tests.cloud_tests.testcases.modules.set_hostname_fqdn', 'function': 'test_no_warnings_in_log', 'traceback': 'Traceback (most recent call last):\n  File "/var/lib/jenkins/slaves/torkoal/workspace/cloud-init-integration-ec2-x/cloud-init/tests/cloud_tests/testcases/base.py", line 149, in test_no_warnings_in_log\n    [], warnings, msg="\'WARN\' found inside cloud-init.log")\nAssertionError: Lists differ: [] != [\'2018-06-10 01:03:13,995 - util.py[WARNING]: No active metadata service found\']\n\nSecond list contains 1 additional elements.\nFirst extra element 0:\n\'2018-06-10 01:03:13,995 - util.py[WARNING]: No active metadata service found\'\n\n- []\n+ [\'2018-06-10 01:03:13,995 - util.py[WARNING]: No active metadata service found\'] : \'WARN\' found inside cloud-init.log\n'}]}, 'modules/runcmd': {'passed': False, 'failures': [{'error': "+ ['2018-06-10 00:56:29,886 - util.py[WARNING]: No active metadata service found'] : 'WARN' found inside cloud-init.log", 'class': 'TestRunCmd', 'module': 'tests.cloud_tests.testcases.modules.runcmd', 'function': 'test_no_warnings_in_log', 'traceback': 'Traceback (most recent call last):\n  File "/var/lib/jenkins/slaves/torkoal/workspace/cloud-init-integration-ec2-x/cloud-init/tests/cloud_tests/testcases/base.py", line 149, in test_no_warnings_in_log\n    [], warnings, msg="\'WARN\' found inside cloud-init.log")\nAssertionError: Lists differ: [] != [\'2018-06-10 00:56:29,886 - util.py[WARNING]: No active metadata service found\']\n\nSecond list contains 1 additional elements.\nFirst extra element 0:\n\'2018-06-10 00:56:29,886 - util.py[WARNING]: No active metadata service found\'\n\n- []\n+ [\'2018-06-10 00:56:29,886 - util.py[WARNING]: No active metadata service found\'] : \'WARN\' found inside cloud-init.log\n'}]}, 'modules/ntp_chrony': {'passed': False, 'failures': [{'error': "+ ['2018-06-10 00:47:40,441 - util.py[WARNING]: No active metadata service found'] : 'WARN' found inside cloud-init.log", 'class': 'TestNtpChrony', 'module': 'tests.cloud_tests.testcases.modules.ntp_chrony', 'function': 'test_no_warnings_in_log', 'traceback': 'Traceback (most recent call last):\n  File "/var/lib/jenkins/slaves/torkoal/workspace/cloud-init-integration-ec2-x/cloud-init/tests/cloud_tests/testcases/base.py", line 149, in test_no_warnings_in_log\n    [], warnings, msg="\'WARN\' found inside cloud-init.log")\nAssertionError: Lists differ: [] != [\'2018-06-10 00:47:40,441 - util.py[WARNING]: No active metadata service found\']\n\nSecond list contains 1 additional elements.\nFirst extra element 0:\n\'2018-06-10 00:47:40,441 - util.py[WARNING]: No active metadata service found\'\n\n- []\n+ [\'2018-06-10 00:47:40,441 - util.py[WARNING]: No active metadata service found\'] : \'WARN\' found inside cloud-init.log\n'}]}, 'modules/set_hostname': {'passed': False, 'failures': [{'error': "+ ['2018-06-10 01:01:38,547 - util.py[WARNING]: No active metadata service found'] : 'WARN' found inside cloud-init.log", 'class': 'TestHostname', 'module': 'tests.cloud_tests.testcases.modules.set_hostname', 'function': 'test_no_warnings_in_log', 'traceback': 'Traceback (most recent call last):\n  File "/var/lib/jenkins/slaves/torkoal/workspace/cloud-init-integration-ec2-x/cloud-init/tests/cloud_tests/testcases/base.py", line 149, in test_no_warnings_in_log\n    [], warnings, msg="\'WARN\' found inside cloud-init.log")\nAssertionError: Lists differ: [] != [\'2018-06-10 01:01:38,547 - util.py[WARNING]: No active metadata service found\']\n\nSecond list contains 1 additional elements.\nFirst extra element 0:\n\'2018-06-10 01:01:38,547 - util.py[WARNING]: No active metadata service found\'\n\n- []\n+ [\'2018-06-10 01:01:38,547 - util.py[WARNING]: No active metadata service found\'] : \'WARN\' found inside cloud-init.log\n'}]}, 'modules/apt_configure_disable_suites': {'passed': False, 'failures': [{'error': "+ ['2018-06-10 00:13:38,986 - util.py[WARNING]: No active metadata service found'] : 'WARN' found inside cloud-init.log", 'class': 'TestAptconfigureDisableSuites', 'module': 'tests.cloud_tests.testcases.modules.apt_configure_disable_suites', 'function': 'test_no_warnings_in_log', 'traceback': 'Traceback (most recent call last):\n  File "/var/lib/jenkins/slaves/torkoal/workspace/cloud-init-integration-ec2-x/cloud-init/tests/cloud_tests/testcases/base.py", line 149, in test_no_warnings_in_log\n    [], warnings, msg="\'WARN\' found inside cloud-init.log")\nAssertionError: Lists differ: [] != [\'2018-06-10 00:13:38,986 - util.py[WARNING]: No active metadata service found\']\n\nSecond list contains 1 additional elements.\nFirst extra element 0:\n\'2018-06-10 00:13:38,986 - util.py[WARNING]: No active metadata service found\'\n\n- []\n+ [\'2018-06-10 00:13:38,986 - util.py[WARNING]: No active metadata service found\'] : \'WARN\' found inside cloud-init.log\n'}]}, 'modules/apt_pipelining_disable': {'passed': False, 'failures': [{'error': "+ ['2018-06-10 00:27:03,059 - util.py[WARNING]: No active metadata service found'] : 'WARN' found inside cloud-init.log", 'class': 'TestAptPipeliningDisable', 'module': 'tests.cloud_tests.testcases.modules.apt_pipelining_disable', 'function': 'test_no_warnings_in_log', 'traceback': 'Traceback (most recent call last):\n  File "/var/lib/jenkins/slaves/torkoal/workspace/cloud-init-integration-ec2-x/cloud-init/tests/cloud_tests/testcases/base.py", line 149, in test_no_warnings_in_log\n    [], warnings, msg="\'WARN\' found inside cloud-init.log")\nAssertionError: Lists differ: [] != [\'2018-06-10 00:27:03,059 - util.py[WARNING]: No active metadata service found\']\n\nSecond list contains 1 additional elements.\nFirst extra element 0:\n\'2018-06-10 00:27:03,059 - util.py[WARNING]: No active metadata service found\'\n\n- []\n+ [\'2018-06-10 00:27:03,059 - util.py[WARNING]: No active metadata service found\'] : \'WARN\' found inside cloud-init.log\n'}]}, 'modules/final_message': {'passed': False, 'failures': [{'error': "+ ['2018-06-10 00:37:40,860 - util.py[WARNING]: No active metadata service found'] : 'WARN' found inside cloud-init.log", 'class': 'TestFinalMessage', 'module': 'tests.cloud_tests.testcases.modules.final_message', 'function': 'test_no_warnings_in_log', 'traceback': 'Traceback (most recent call last):\n  File "/var/lib/jenkins/slaves/torkoal/workspace/cloud-init-integration-ec2-x/cloud-init/tests/cloud_tests/testcases/base.py", line 149, in test_no_warnings_in_log\n    [], warnings, msg="\'WARN\' found inside cloud-init.log")\nAssertionError: Lists differ: [] != [\'2018-06-10 00:37:40,860 - util.py[WARNING]: No active metadata service found\']\n\nSecond list contains 1 additional elements.\nFirst extra element 0:\n\'2018-06-10 00:37:40,860 - util.py[WARNING]: No active metadata service found\'\n\n- []\n+ [\'2018-06-10 00:37:40,860 - util.py[WARNING]: No active metadata service found\'] : \'WARN\' found inside cloud-init.log\n'}]}}}}
2018-06-10 01:25:33,044 - tests.cloud_tests - INFO - leaving data in /var/lib/jenkins/slaves/torkoal/workspace/cloud-init-integration-ec2-x/cloud-init/results
ERROR: InvocationError: '/var/lib/jenkins/slaves/torkoal/workspace/cloud-init-integration-ec2-x/cloud-init/.tox/citest/bin/python -m tests.cloud_tests run --os-name xenial --platform ec2 --preserve-data --data-dir results --verbose --deb cloud-init_18.2-1883-gfc23ccc-0ubuntu1+1378~trunk~ubuntu16.04.1_all.deb'
___________________________________ summary ____________________________________
ERROR:   citest: commands failed
Build step 'Execute shell' marked build as failure
Sending e-mails to: server-crew-qa@lists.canonical.com
Archiving artifacts
Started calculate disk usage of build
Finished Calculation of disk usage of build in 0 seconds
Started calculate disk usage of workspace
Finished Calculation of disk usage of workspace in 0 seconds
Triggering a new build of cloud-init-integration-ec2-terminate
Finished: FAILURE