FailedConsole Output

Skipping 244 KB.. Full Log
>/debian/cloud-init/usr/lib/python3.5/dist-packages/cloudinit/sources/helpers/vmware/imc/config_passwd.py to config_passwd.cpython-35.pyc
byte-compiling /<<PKGBUILDDIR>>/debian/cloud-init/usr/lib/python3.5/dist-packages/cloudinit/sources/helpers/vmware/__init__.py to __init__.cpython-35.pyc
byte-compiling /<<PKGBUILDDIR>>/debian/cloud-init/usr/lib/python3.5/dist-packages/cloudinit/sources/helpers/__init__.py to __init__.cpython-35.pyc
byte-compiling /<<PKGBUILDDIR>>/debian/cloud-init/usr/lib/python3.5/dist-packages/cloudinit/sources/helpers/azure.py to azure.cpython-35.pyc
byte-compiling /<<PKGBUILDDIR>>/debian/cloud-init/usr/lib/python3.5/dist-packages/cloudinit/sources/helpers/openstack.py to openstack.cpython-35.pyc
byte-compiling /<<PKGBUILDDIR>>/debian/cloud-init/usr/lib/python3.5/dist-packages/cloudinit/sources/DataSourceOpenStack.py to DataSourceOpenStack.cpython-35.pyc
byte-compiling /<<PKGBUILDDIR>>/debian/cloud-init/usr/lib/python3.5/dist-packages/cloudinit/sources/DataSourceBigstep.py to DataSourceBigstep.cpython-35.pyc
byte-compiling /<<PKGBUILDDIR>>/debian/cloud-init/usr/lib/python3.5/dist-packages/cloudinit/helpers.py to helpers.cpython-35.pyc
byte-compiling /<<PKGBUILDDIR>>/debian/cloud-init/usr/lib/python3.5/dist-packages/cloudinit/dhclient_hook.py to dhclient_hook.cpython-35.pyc
byte-compiling /<<PKGBUILDDIR>>/debian/cloud-init/usr/lib/python3.5/dist-packages/cloudinit/user_data.py to user_data.cpython-35.pyc
byte-compiling /<<PKGBUILDDIR>>/debian/cloud-init/usr/lib/python3.5/dist-packages/cloudinit/ec2_utils.py to ec2_utils.cpython-35.pyc
byte-compiling /<<PKGBUILDDIR>>/debian/cloud-init/usr/lib/python3.5/dist-packages/cloudinit/log.py to log.cpython-35.pyc
byte-compiling /<<PKGBUILDDIR>>/debian/cloud-init/usr/lib/python3.5/dist-packages/cloudinit/atomic_helper.py to atomic_helper.cpython-35.pyc
byte-compiling /<<PKGBUILDDIR>>/debian/cloud-init/usr/lib/python3.5/dist-packages/cloudinit/cloud.py to cloud.cpython-35.pyc
byte-compiling /<<PKGBUILDDIR>>/debian/cloud-init/usr/lib/python3.5/dist-packages/cloudinit/url_helper.py to url_helper.cpython-35.pyc
byte-compiling /<<PKGBUILDDIR>>/debian/cloud-init/usr/lib/python3.5/dist-packages/cloudinit/handlers/upstart_job.py to upstart_job.cpython-35.pyc
byte-compiling /<<PKGBUILDDIR>>/debian/cloud-init/usr/lib/python3.5/dist-packages/cloudinit/handlers/shell_script.py to shell_script.cpython-35.pyc
byte-compiling /<<PKGBUILDDIR>>/debian/cloud-init/usr/lib/python3.5/dist-packages/cloudinit/handlers/cloud_config.py to cloud_config.cpython-35.pyc
byte-compiling /<<PKGBUILDDIR>>/debian/cloud-init/usr/lib/python3.5/dist-packages/cloudinit/handlers/__init__.py to __init__.cpython-35.pyc
byte-compiling /<<PKGBUILDDIR>>/debian/cloud-init/usr/lib/python3.5/dist-packages/cloudinit/handlers/boot_hook.py to boot_hook.cpython-35.pyc
byte-compiling /<<PKGBUILDDIR>>/debian/cloud-init/usr/lib/python3.5/dist-packages/cloudinit/templater.py to templater.cpython-35.pyc
byte-compiling /<<PKGBUILDDIR>>/debian/cloud-init/usr/lib/python3.5/dist-packages/cloudinit/netinfo.py to netinfo.cpython-35.pyc
byte-compiling /<<PKGBUILDDIR>>/debian/cloud-init/usr/lib/python3.5/dist-packages/cloudinit/config/cc_byobu.py to cc_byobu.cpython-35.pyc
byte-compiling /<<PKGBUILDDIR>>/debian/cloud-init/usr/lib/python3.5/dist-packages/cloudinit/config/cc_seed_random.py to cc_seed_random.cpython-35.pyc
byte-compiling /<<PKGBUILDDIR>>/debian/cloud-init/usr/lib/python3.5/dist-packages/cloudinit/config/cc_bootcmd.py to cc_bootcmd.cpython-35.pyc
byte-compiling /<<PKGBUILDDIR>>/debian/cloud-init/usr/lib/python3.5/dist-packages/cloudinit/config/cc_zypper_add_repo.py to cc_zypper_add_repo.cpython-35.pyc
byte-compiling /<<PKGBUILDDIR>>/debian/cloud-init/usr/lib/python3.5/dist-packages/cloudinit/config/cc_set_passwords.py to cc_set_passwords.cpython-35.pyc
byte-compiling /<<PKGBUILDDIR>>/debian/cloud-init/usr/lib/python3.5/dist-packages/cloudinit/config/cc_ssh_import_id.py to cc_ssh_import_id.cpython-35.pyc
byte-compiling /<<PKGBUILDDIR>>/debian/cloud-init/usr/lib/python3.5/dist-packages/cloudinit/config/cc_spacewalk.py to cc_spacewalk.cpython-35.pyc
byte-compiling /<<PKGBUILDDIR>>/debian/cloud-init/usr/lib/python3.5/dist-packages/cloudinit/config/cc_salt_minion.py to cc_salt_minion.cpython-35.pyc
byte-compiling /<<PKGBUILDDIR>>/debian/cloud-init/usr/lib/python3.5/dist-packages/cloudinit/config/cc_power_state_change.py to cc_power_state_change.cpython-35.pyc
byte-compiling /<<PKGBUILDDIR>>/debian/cloud-init/usr/lib/python3.5/dist-packages/cloudinit/config/cc_update_hostname.py to cc_update_hostname.cpython-35.pyc
byte-compiling /<<PKGBUILDDIR>>/debian/cloud-init/usr/lib/python3.5/dist-packages/cloudinit/config/cc_scripts_per_once.py to cc_scripts_per_once.cpython-35.pyc
byte-compiling /<<PKGBUILDDIR>>/debian/cloud-init/usr/lib/python3.5/dist-packages/cloudinit/config/cc_migrator.py to cc_migrator.cpython-35.pyc
byte-compiling /<<PKGBUILDDIR>>/debian/cloud-init/usr/lib/python3.5/dist-packages/cloudinit/config/cc_disable_ec2_metadata.py to cc_disable_ec2_metadata.cpython-35.pyc
byte-compiling /<<PKGBUILDDIR>>/debian/cloud-init/usr/lib/python3.5/dist-packages/cloudinit/config/cc_ntp.py to cc_ntp.cpython-35.pyc
byte-compiling /<<PKGBUILDDIR>>/debian/cloud-init/usr/lib/python3.5/dist-packages/cloudinit/config/cc_set_hostname.py to cc_set_hostname.cpython-35.pyc
byte-compiling /<<PKGBUILDDIR>>/debian/cloud-init/usr/lib/python3.5/dist-packages/cloudinit/config/cc_chef.py to cc_chef.cpython-35.pyc
byte-compiling /<<PKGBUILDDIR>>/debian/cloud-init/usr/lib/python3.5/dist-packages/cloudinit/config/cc_rightscale_userdata.py to cc_rightscale_userdata.cpython-35.pyc
byte-compiling /<<PKGBUILDDIR>>/debian/cloud-init/usr/lib/python3.5/dist-packages/cloudinit/config/cc_grub_dpkg.py to cc_grub_dpkg.cpython-35.pyc
byte-compiling /<<PKGBUILDDIR>>/debian/cloud-init/usr/lib/python3.5/dist-packages/cloudinit/config/cc_ca_certs.py to cc_ca_certs.cpython-35.pyc
byte-compiling /<<PKGBUILDDIR>>/debian/cloud-init/usr/lib/python3.5/dist-packages/cloudinit/config/cc_update_etc_hosts.py to cc_update_etc_hosts.cpython-35.pyc
byte-compiling /<<PKGBUILDDIR>>/debian/cloud-init/usr/lib/python3.5/dist-packages/cloudinit/config/cc_rsyslog.py to cc_rsyslog.cpython-35.pyc
byte-compiling /<<PKGBUILDDIR>>/debian/cloud-init/usr/lib/python3.5/dist-packages/cloudinit/config/cc_foo.py to cc_foo.cpython-35.pyc
byte-compiling /<<PKGBUILDDIR>>/debian/cloud-init/usr/lib/python3.5/dist-packages/cloudinit/config/cc_mcollective.py to cc_mcollective.cpython-35.pyc
byte-compiling /<<PKGBUILDDIR>>/debian/cloud-init/usr/lib/python3.5/dist-packages/cloudinit/config/cc_lxd.py to cc_lxd.cpython-35.pyc
byte-compiling /<<PKGBUILDDIR>>/debian/cloud-init/usr/lib/python3.5/dist-packages/cloudinit/config/cc_scripts_user.py to cc_scripts_user.cpython-35.pyc
byte-compiling /<<PKGBUILDDIR>>/debian/cloud-init/usr/lib/python3.5/dist-packages/cloudinit/config/cc_fan.py to cc_fan.cpython-35.pyc
byte-compiling /<<PKGBUILDDIR>>/debian/cloud-init/usr/lib/python3.5/dist-packages/cloudinit/config/cc_mounts.py to cc_mounts.cpython-35.pyc
byte-compiling /<<PKGBUILDDIR>>/debian/cloud-init/usr/lib/python3.5/dist-packages/cloudinit/config/cc_puppet.py to cc_puppet.cpython-35.pyc
byte-compiling /<<PKGBUILDDIR>>/debian/cloud-init/usr/lib/python3.5/dist-packages/cloudinit/config/cc_users_groups.py to cc_users_groups.cpython-35.pyc
byte-compiling /<<PKGBUILDDIR>>/debian/cloud-init/usr/lib/python3.5/dist-packages/cloudinit/config/cc_debug.py to cc_debug.cpython-35.pyc
byte-compiling /<<PKGBUILDDIR>>/debian/cloud-init/usr/lib/python3.5/dist-packages/cloudinit/config/cc_resizefs.py to cc_resizefs.cpython-35.pyc
byte-compiling /<<PKGBUILDDIR>>/debian/cloud-init/usr/lib/python3.5/dist-packages/cloudinit/config/cc_rh_subscription.py to cc_rh_subscription.cpython-35.pyc
byte-compiling /<<PKGBUILDDIR>>/debian/cloud-init/usr/lib/python3.5/dist-packages/cloudinit/config/cc_apt_pipelining.py to cc_apt_pipelining.cpython-35.pyc
byte-compiling /<<PKGBUILDDIR>>/debian/cloud-init/usr/lib/python3.5/dist-packages/cloudinit/config/cc_scripts_per_boot.py to cc_scripts_per_boot.cpython-35.pyc
byte-compiling /<<PKGBUILDDIR>>/debian/cloud-init/usr/lib/python3.5/dist-packages/cloudinit/config/cc_package_update_upgrade_install.py to cc_package_update_upgrade_install.cpython-35.pyc
byte-compiling /<<PKGBUILDDIR>>/debian/cloud-init/usr/lib/python3.5/dist-packages/cloudinit/config/cc_growpart.py to cc_growpart.cpython-35.pyc
byte-compiling /<<PKGBUILDDIR>>/debian/cloud-init/usr/lib/python3.5/dist-packages/cloudinit/config/__init__.py to __init__.cpython-35.pyc
byte-compiling /<<PKGBUILDDIR>>/debian/cloud-init/usr/lib/python3.5/dist-packages/cloudinit/config/cc_keys_to_console.py to cc_keys_to_console.cpython-35.pyc
byte-compiling /<<PKGBUILDDIR>>/debian/cloud-init/usr/lib/python3.5/dist-packages/cloudinit/config/cc_apt_configure.py to cc_apt_configure.cpython-35.pyc
byte-compiling /<<PKGBUILDDIR>>/debian/cloud-init/usr/lib/python3.5/dist-packages/cloudinit/config/cc_scripts_vendor.py to cc_scripts_vendor.cpython-35.pyc
byte-compiling /<<PKGBUILDDIR>>/debian/cloud-init/usr/lib/python3.5/dist-packages/cloudinit/config/cc_disk_setup.py to cc_disk_setup.cpython-35.pyc
byte-compiling /<<PKGBUILDDIR>>/debian/cloud-init/usr/lib/python3.5/dist-packages/cloudinit/config/cc_final_message.py to cc_final_message.cpython-35.pyc
byte-compiling /<<PKGBUILDDIR>>/debian/cloud-init/usr/lib/python3.5/dist-packages/cloudinit/config/cc_landscape.py to cc_landscape.cpython-35.pyc
byte-compiling /<<PKGBUILDDIR>>/debian/cloud-init/usr/lib/python3.5/dist-packages/cloudinit/config/cc_snappy.py to cc_snappy.cpython-35.pyc
byte-compiling /<<PKGBUILDDIR>>/debian/cloud-init/usr/lib/python3.5/dist-packages/cloudinit/config/cc_yum_add_repo.py to cc_yum_add_repo.cpython-35.pyc
byte-compiling /<<PKGBUILDDIR>>/debian/cloud-init/usr/lib/python3.5/dist-packages/cloudinit/config/cc_snap_config.py to cc_snap_config.cpython-35.pyc
byte-compiling /<<PKGBUILDDIR>>/debian/cloud-init/usr/lib/python3.5/dist-packages/cloudinit/config/cc_resolv_conf.py to cc_resolv_conf.cpython-35.pyc
byte-compiling /<<PKGBUILDDIR>>/debian/cloud-init/usr/lib/python3.5/dist-packages/cloudinit/config/schema.py to schema.cpython-35.pyc
byte-compiling /<<PKGBUILDDIR>>/debian/cloud-init/usr/lib/python3.5/dist-packages/cloudinit/config/cc_write_files.py to cc_write_files.cpython-35.pyc
byte-compiling /<<PKGBUILDDIR>>/debian/cloud-init/usr/lib/python3.5/dist-packages/cloudinit/config/cc_timezone.py to cc_timezone.cpython-35.pyc
byte-compiling /<<PKGBUILDDIR>>/debian/cloud-init/usr/lib/python3.5/dist-packages/cloudinit/config/cc_ssh.py to cc_ssh.cpython-35.pyc
byte-compiling /<<PKGBUILDDIR>>/debian/cloud-init/usr/lib/python3.5/dist-packages/cloudinit/config/cc_phone_home.py to cc_phone_home.cpython-35.pyc
byte-compiling /<<PKGBUILDDIR>>/debian/cloud-init/usr/lib/python3.5/dist-packages/cloudinit/config/cc_scripts_per_instance.py to cc_scripts_per_instance.cpython-35.pyc
byte-compiling /<<PKGBUILDDIR>>/debian/cloud-init/usr/lib/python3.5/dist-packages/cloudinit/config/cc_emit_upstart.py to cc_emit_upstart.cpython-35.pyc
byte-compiling /<<PKGBUILDDIR>>/debian/cloud-init/usr/lib/python3.5/dist-packages/cloudinit/config/cc_ssh_authkey_fingerprints.py to cc_ssh_authkey_fingerprints.cpython-35.pyc
byte-compiling /<<PKGBUILDDIR>>/debian/cloud-init/usr/lib/python3.5/dist-packages/cloudinit/config/cc_locale.py to cc_locale.cpython-35.pyc
byte-compiling /<<PKGBUILDDIR>>/debian/cloud-init/usr/lib/python3.5/dist-packages/cloudinit/config/cc_runcmd.py to cc_runcmd.cpython-35.pyc
byte-compiling /<<PKGBUILDDIR>>/debian/cloud-init/usr/lib/python3.5/dist-packages/cloudinit/net/network_state.py to network_state.cpython-35.pyc
byte-compiling /<<PKGBUILDDIR>>/debian/cloud-init/usr/lib/python3.5/dist-packages/cloudinit/net/udev.py to udev.cpython-35.pyc
byte-compiling /<<PKGBUILDDIR>>/debian/cloud-init/usr/lib/python3.5/dist-packages/cloudinit/net/eni.py to eni.cpython-35.pyc
byte-compiling /<<PKGBUILDDIR>>/debian/cloud-init/usr/lib/python3.5/dist-packages/cloudinit/net/renderers.py to renderers.cpython-35.pyc
byte-compiling /<<PKGBUILDDIR>>/debian/cloud-init/usr/lib/python3.5/dist-packages/cloudinit/net/renderer.py to renderer.cpython-35.pyc
byte-compiling /<<PKGBUILDDIR>>/debian/cloud-init/usr/lib/python3.5/dist-packages/cloudinit/net/sysconfig.py to sysconfig.cpython-35.pyc
byte-compiling /<<PKGBUILDDIR>>/debian/cloud-init/usr/lib/python3.5/dist-packages/cloudinit/net/cmdline.py to cmdline.cpython-35.pyc
byte-compiling /<<PKGBUILDDIR>>/debian/cloud-init/usr/lib/python3.5/dist-packages/cloudinit/net/__init__.py to __init__.cpython-35.pyc
byte-compiling /<<PKGBUILDDIR>>/debian/cloud-init/usr/lib/python3.5/dist-packages/cloudinit/net/dhcp.py to dhcp.cpython-35.pyc
byte-compiling /<<PKGBUILDDIR>>/debian/cloud-init/usr/lib/python3.5/dist-packages/cloudinit/net/netplan.py to netplan.cpython-35.pyc
byte-compiling /<<PKGBUILDDIR>>/debian/cloud-init/usr/lib/python3.5/dist-packages/cloudinit/signal_handler.py to signal_handler.cpython-35.pyc
byte-compiling /<<PKGBUILDDIR>>/debian/cloud-init/usr/lib/python3.5/dist-packages/cloudinit/__init__.py to __init__.cpython-35.pyc
byte-compiling /<<PKGBUILDDIR>>/debian/cloud-init/usr/lib/python3.5/dist-packages/cloudinit/registry.py to registry.cpython-35.pyc
byte-compiling /<<PKGBUILDDIR>>/debian/cloud-init/usr/lib/python3.5/dist-packages/cloudinit/filters/launch_index.py to launch_index.cpython-35.pyc
byte-compiling /<<PKGBUILDDIR>>/debian/cloud-init/usr/lib/python3.5/dist-packages/cloudinit/filters/__init__.py to __init__.cpython-35.pyc
byte-compiling /<<PKGBUILDDIR>>/debian/cloud-init/usr/lib/python3.5/dist-packages/cloudinit/serial.py to serial.cpython-35.pyc
byte-compiling /<<PKGBUILDDIR>>/debian/cloud-init/usr/lib/python3.5/dist-packages/cloudinit/temp_utils.py to temp_utils.cpython-35.pyc
byte-compiling /<<PKGBUILDDIR>>/debian/cloud-init/usr/lib/python3.5/dist-packages/cloudinit/ssh_util.py to ssh_util.cpython-35.pyc
byte-compiling /<<PKGBUILDDIR>>/debian/cloud-init/usr/lib/python3.5/dist-packages/cloudinit/version.py to version.cpython-35.pyc
byte-compiling /<<PKGBUILDDIR>>/debian/cloud-init/usr/lib/python3.5/dist-packages/cloudinit/importer.py to importer.cpython-35.pyc
byte-compiling /<<PKGBUILDDIR>>/debian/cloud-init/usr/lib/python3.5/dist-packages/cloudinit/type_utils.py to type_utils.cpython-35.pyc
byte-compiling /<<PKGBUILDDIR>>/debian/cloud-init/usr/lib/python3.5/dist-packages/cloudinit/cs_utils.py to cs_utils.cpython-35.pyc
byte-compiling /<<PKGBUILDDIR>>/debian/cloud-init/usr/lib/python3.5/dist-packages/cloudinit/stages.py to stages.cpython-35.pyc
byte-compiling /<<PKGBUILDDIR>>/debian/cloud-init/usr/lib/python3.5/dist-packages/cloudinit/cmd/devel/parser.py to parser.cpython-35.pyc
byte-compiling /<<PKGBUILDDIR>>/debian/cloud-init/usr/lib/python3.5/dist-packages/cloudinit/cmd/devel/__init__.py to __init__.cpython-35.pyc
byte-compiling /<<PKGBUILDDIR>>/debian/cloud-init/usr/lib/python3.5/dist-packages/cloudinit/cmd/devel/logs.py to logs.cpython-35.pyc
byte-compiling /<<PKGBUILDDIR>>/debian/cloud-init/usr/lib/python3.5/dist-packages/cloudinit/cmd/main.py to main.cpython-35.pyc
byte-compiling /<<PKGBUILDDIR>>/debian/cloud-init/usr/lib/python3.5/dist-packages/cloudinit/cmd/clean.py to clean.cpython-35.pyc
byte-compiling /<<PKGBUILDDIR>>/debian/cloud-init/usr/lib/python3.5/dist-packages/cloudinit/cmd/status.py to status.cpython-35.pyc
byte-compiling /<<PKGBUILDDIR>>/debian/cloud-init/usr/lib/python3.5/dist-packages/cloudinit/cmd/__init__.py to __init__.cpython-35.pyc
byte-compiling /<<PKGBUILDDIR>>/debian/cloud-init/usr/lib/python3.5/dist-packages/cloudinit/gpg.py to gpg.cpython-35.pyc
byte-compiling /<<PKGBUILDDIR>>/debian/cloud-init/usr/lib/python3.5/dist-packages/cloudinit/patcher.py to patcher.cpython-35.pyc
byte-compiling /<<PKGBUILDDIR>>/debian/cloud-init/usr/lib/python3.5/dist-packages/cloudinit/mergers/m_list.py to m_list.cpython-35.pyc
byte-compiling /<<PKGBUILDDIR>>/debian/cloud-init/usr/lib/python3.5/dist-packages/cloudinit/mergers/__init__.py to __init__.cpython-35.pyc
byte-compiling /<<PKGBUILDDIR>>/debian/cloud-init/usr/lib/python3.5/dist-packages/cloudinit/mergers/m_dict.py to m_dict.cpython-35.pyc
byte-compiling /<<PKGBUILDDIR>>/debian/cloud-init/usr/lib/python3.5/dist-packages/cloudinit/mergers/m_str.py to m_str.cpython-35.pyc
byte-compiling /<<PKGBUILDDIR>>/debian/cloud-init/usr/lib/python3.5/dist-packages/cloudinit/reporting/events.py to events.cpython-35.pyc
byte-compiling /<<PKGBUILDDIR>>/debian/cloud-init/usr/lib/python3.5/dist-packages/cloudinit/reporting/__init__.py to __init__.cpython-35.pyc
byte-compiling /<<PKGBUILDDIR>>/debian/cloud-init/usr/lib/python3.5/dist-packages/cloudinit/reporting/handlers.py to handlers.cpython-35.pyc
byte-compiling /<<PKGBUILDDIR>>/debian/cloud-init/usr/lib/python3.5/dist-packages/cloudinit/util.py to util.cpython-35.pyc
byte-compiling /<<PKGBUILDDIR>>/debian/cloud-init/usr/lib/python3.5/dist-packages/cloudinit/apport.py to apport.cpython-35.pyc
byte-compiling /<<PKGBUILDDIR>>/debian/cloud-init/usr/lib/python3.5/dist-packages/cloudinit/settings.py to settings.cpython-35.pyc
running install_data
copying tmp7zjhsvvb/cloud.cfg -> /<<PKGBUILDDIR>>/debian/cloud-init/etc/cloud
creating /<<PKGBUILDDIR>>/debian/cloud-init/etc/cloud/cloud.cfg.d
copying config/cloud.cfg.d/05_logging.cfg -> /<<PKGBUILDDIR>>/debian/cloud-init/etc/cloud/cloud.cfg.d
copying config/cloud.cfg.d/README -> /<<PKGBUILDDIR>>/debian/cloud-init/etc/cloud/cloud.cfg.d
creating /<<PKGBUILDDIR>>/debian/cloud-init/etc/cloud/templates
copying templates/hosts.suse.tmpl -> /<<PKGBUILDDIR>>/debian/cloud-init/etc/cloud/templates
copying templates/chef_client.rb.tmpl -> /<<PKGBUILDDIR>>/debian/cloud-init/etc/cloud/templates
copying templates/ntp.conf.ubuntu.tmpl -> /<<PKGBUILDDIR>>/debian/cloud-init/etc/cloud/templates
copying templates/sources.list.ubuntu.tmpl -> /<<PKGBUILDDIR>>/debian/cloud-init/etc/cloud/templates
copying templates/hosts.debian.tmpl -> /<<PKGBUILDDIR>>/debian/cloud-init/etc/cloud/templates
copying templates/hosts.freebsd.tmpl -> /<<PKGBUILDDIR>>/debian/cloud-init/etc/cloud/templates
copying templates/ntp.conf.sles.tmpl -> /<<PKGBUILDDIR>>/debian/cloud-init/etc/cloud/templates
copying templates/ntp.conf.opensuse.tmpl -> /<<PKGBUILDDIR>>/debian/cloud-init/etc/cloud/templates
copying templates/sources.list.debian.tmpl -> /<<PKGBUILDDIR>>/debian/cloud-init/etc/cloud/templates
copying templates/hosts.redhat.tmpl -> /<<PKGBUILDDIR>>/debian/cloud-init/etc/cloud/templates
copying templates/resolv.conf.tmpl -> /<<PKGBUILDDIR>>/debian/cloud-init/etc/cloud/templates
copying templates/ntp.conf.rhel.tmpl -> /<<PKGBUILDDIR>>/debian/cloud-init/etc/cloud/templates
copying templates/ntp.conf.debian.tmpl -> /<<PKGBUILDDIR>>/debian/cloud-init/etc/cloud/templates
copying templates/timesyncd.conf.tmpl -> /<<PKGBUILDDIR>>/debian/cloud-init/etc/cloud/templates
copying templates/ntp.conf.fedora.tmpl -> /<<PKGBUILDDIR>>/debian/cloud-init/etc/cloud/templates
creating /<<PKGBUILDDIR>>/debian/cloud-init/usr/lib/cloud-init
copying tools/ds-identify -> /<<PKGBUILDDIR>>/debian/cloud-init/usr/lib/cloud-init
copying tools/uncloud-init -> /<<PKGBUILDDIR>>/debian/cloud-init/usr/lib/cloud-init
copying tools/write-ssh-key-fingerprints -> /<<PKGBUILDDIR>>/debian/cloud-init/usr/lib/cloud-init
creating /<<PKGBUILDDIR>>/debian/cloud-init/usr/share/doc/cloud-init
copying doc/var-lib-cloud.txt -> /<<PKGBUILDDIR>>/debian/cloud-init/usr/share/doc/cloud-init
copying doc/userdata.txt -> /<<PKGBUILDDIR>>/debian/cloud-init/usr/share/doc/cloud-init
copying doc/status.txt -> /<<PKGBUILDDIR>>/debian/cloud-init/usr/share/doc/cloud-init
copying doc/README -> /<<PKGBUILDDIR>>/debian/cloud-init/usr/share/doc/cloud-init
creating /<<PKGBUILDDIR>>/debian/cloud-init/usr/share/doc/cloud-init/examples
copying doc/examples/cloud-config-phone-home.txt -> /<<PKGBUILDDIR>>/debian/cloud-init/usr/share/doc/cloud-init/examples
copying doc/examples/cloud-config-reporting.txt -> /<<PKGBUILDDIR>>/debian/cloud-init/usr/share/doc/cloud-init/examples
copying doc/examples/cloud-config-mcollective.txt -> /<<PKGBUILDDIR>>/debian/cloud-init/usr/share/doc/cloud-init/examples
copying doc/examples/user-script.txt -> /<<PKGBUILDDIR>>/debian/cloud-init/usr/share/doc/cloud-init/examples
copying doc/examples/cloud-config-update-packages.txt -> /<<PKGBUILDDIR>>/debian/cloud-init/usr/share/doc/cloud-init/examples
copying doc/examples/include-once.txt -> /<<PKGBUILDDIR>>/debian/cloud-init/usr/share/doc/cloud-init/examples
copying doc/examples/cloud-config.txt -> /<<PKGBUILDDIR>>/debian/cloud-init/usr/share/doc/cloud-init/examples
copying doc/examples/include.txt -> /<<PKGBUILDDIR>>/debian/cloud-init/usr/share/doc/cloud-init/examples
copying doc/examples/kernel-cmdline.txt -> /<<PKGBUILDDIR>>/debian/cloud-init/usr/share/doc/cloud-init/examples
copying doc/examples/cloud-config-salt-minion.txt -> /<<PKGBUILDDIR>>/debian/cloud-init/usr/share/doc/cloud-init/examples
copying doc/examples/cloud-config-datasources.txt -> /<<PKGBUILDDIR>>/debian/cloud-init/usr/share/doc/cloud-init/examples
copying doc/examples/plain-ignored.txt -> /<<PKGBUILDDIR>>/debian/cloud-init/usr/share/doc/cloud-init/examples
copying doc/examples/cloud-config-rsyslog.txt -> /<<PKGBUILDDIR>>/debian/cloud-init/usr/share/doc/cloud-init/examples
copying doc/examples/cloud-config-growpart.txt -> /<<PKGBUILDDIR>>/debian/cloud-init/usr/share/doc/cloud-init/examples
copying doc/examples/cloud-config-chef-oneiric.txt -> /<<PKGBUILDDIR>>/debian/cloud-init/usr/share/doc/cloud-init/examples
copying doc/examples/cloud-config-rh_subscription.txt -> /<<PKGBUILDDIR>>/debian/cloud-init/usr/share/doc/cloud-init/examples
copying doc/examples/cloud-config-update-apt.txt -> /<<PKGBUILDDIR>>/debian/cloud-init/usr/share/doc/cloud-init/examples
copying doc/examples/cloud-config-ssh-keys.txt -> /<<PKGBUILDDIR>>/debian/cloud-init/usr/share/doc/cloud-init/examples
copying doc/examples/cloud-config-boot-cmds.txt -> /<<PKGBUILDDIR>>/debian/cloud-init/usr/share/doc/cloud-init/examples
copying doc/examples/cloud-config-chef.txt -> /<<PKGBUILDDIR>>/debian/cloud-init/usr/share/doc/cloud-init/examples
copying doc/examples/cloud-config-power-state.txt -> /<<PKGBUILDDIR>>/debian/cloud-init/usr/share/doc/cloud-init/examples
copying doc/examples/cloud-config-apt.txt -> /<<PKGBUILDDIR>>/debian/cloud-init/usr/share/doc/cloud-init/examples
copying doc/examples/cloud-config-gluster.txt -> /<<PKGBUILDDIR>>/debian/cloud-init/usr/share/doc/cloud-init/examples
copying doc/examples/cloud-config-write-files.txt -> /<<PKGBUILDDIR>>/debian/cloud-init/usr/share/doc/cloud-init/examples
copying doc/examples/cloud-config-lxd.txt -> /<<PKGBUILDDIR>>/debian/cloud-init/usr/share/doc/cloud-init/examples
copying doc/examples/cloud-config-seed-random.txt -> /<<PKGBUILDDIR>>/debian/cloud-init/usr/share/doc/cloud-init/examples
copying doc/examples/cloud-config-final-message.txt -> /<<PKGBUILDDIR>>/debian/cloud-init/usr/share/doc/cloud-init/examples
copying doc/examples/cloud-config-landscape.txt -> /<<PKGBUILDDIR>>/debian/cloud-init/usr/share/doc/cloud-init/examples
copying doc/examples/cloud-config-archive.txt -> /<<PKGBUILDDIR>>/debian/cloud-init/usr/share/doc/cloud-init/examples
copying doc/examples/cloud-config-resolv-conf.txt -> /<<PKGBUILDDIR>>/debian/cloud-init/usr/share/doc/cloud-init/examples
copying doc/examples/cloud-config-yum-repo.txt -> /<<PKGBUILDDIR>>/debian/cloud-init/usr/share/doc/cloud-init/examples
copying doc/examples/cloud-config-archive-launch-index.txt -> /<<PKGBUILDDIR>>/debian/cloud-init/usr/share/doc/cloud-init/examples
copying doc/examples/cloud-config-disk-setup.txt -> /<<PKGBUILDDIR>>/debian/cloud-init/usr/share/doc/cloud-init/examples
copying doc/examples/upstart-cloud-config.txt -> /<<PKGBUILDDIR>>/debian/cloud-init/usr/share/doc/cloud-init/examples
copying doc/examples/cloud-config-user-groups.txt -> /<<PKGBUILDDIR>>/debian/cloud-init/usr/share/doc/cloud-init/examples
copying doc/examples/part-handler-v2.txt -> /<<PKGBUILDDIR>>/debian/cloud-init/usr/share/doc/cloud-init/examples
copying doc/examples/cloud-config-run-cmds.txt -> /<<PKGBUILDDIR>>/debian/cloud-init/usr/share/doc/cloud-init/examples
copying doc/examples/cloud-config-install-packages.txt -> /<<PKGBUILDDIR>>/debian/cloud-init/usr/share/doc/cloud-init/examples
copying doc/examples/cloud-config-add-apt-repos.txt -> /<<PKGBUILDDIR>>/debian/cloud-init/usr/share/doc/cloud-init/examples
copying doc/examples/cloud-config-ntp.txt -> /<<PKGBUILDDIR>>/debian/cloud-init/usr/share/doc/cloud-init/examples
copying doc/examples/cloud-config-mount-points.txt -> /<<PKGBUILDDIR>>/debian/cloud-init/usr/share/doc/cloud-init/examples
copying doc/examples/cloud-config-vendor-data.txt -> /<<PKGBUILDDIR>>/debian/cloud-init/usr/share/doc/cloud-init/examples
copying doc/examples/upstart-rclocal.txt -> /<<PKGBUILDDIR>>/debian/cloud-init/usr/share/doc/cloud-init/examples
copying doc/examples/cloud-config-puppet.txt -> /<<PKGBUILDDIR>>/debian/cloud-init/usr/share/doc/cloud-init/examples
copying doc/examples/part-handler.txt -> /<<PKGBUILDDIR>>/debian/cloud-init/usr/share/doc/cloud-init/examples
copying doc/examples/cloud-config-ca-certs.txt -> /<<PKGBUILDDIR>>/debian/cloud-init/usr/share/doc/cloud-init/examples
copying doc/examples/cloud-config-launch-index.txt -> /<<PKGBUILDDIR>>/debian/cloud-init/usr/share/doc/cloud-init/examples
creating /<<PKGBUILDDIR>>/debian/cloud-init/usr/share/doc/cloud-init/examples/seed
copying doc/examples/seed/user-data -> /<<PKGBUILDDIR>>/debian/cloud-init/usr/share/doc/cloud-init/examples/seed
copying doc/examples/seed/meta-data -> /<<PKGBUILDDIR>>/debian/cloud-init/usr/share/doc/cloud-init/examples/seed
copying doc/examples/seed/README -> /<<PKGBUILDDIR>>/debian/cloud-init/usr/share/doc/cloud-init/examples/seed
creating /<<PKGBUILDDIR>>/debian/cloud-init/etc/NetworkManager
creating /<<PKGBUILDDIR>>/debian/cloud-init/etc/NetworkManager/dispatcher.d
copying tools/hook-network-manager -> /<<PKGBUILDDIR>>/debian/cloud-init/etc/NetworkManager/dispatcher.d/
creating /<<PKGBUILDDIR>>/debian/cloud-init/etc/dhcp
creating /<<PKGBUILDDIR>>/debian/cloud-init/etc/dhcp/dhclient-exit-hooks.d
copying tools/hook-dhclient -> /<<PKGBUILDDIR>>/debian/cloud-init/etc/dhcp/dhclient-exit-hooks.d/
copying udev/66-azure-ephemeral.rules -> /<<PKGBUILDDIR>>/debian/cloud-init/lib/udev/rules.d
creating /<<PKGBUILDDIR>>/debian/cloud-init/lib/systemd
creating /<<PKGBUILDDIR>>/debian/cloud-init/lib/systemd/system-generators
copying systemd/cloud-init-generator -> /<<PKGBUILDDIR>>/debian/cloud-init/lib/systemd/system-generators
creating /<<PKGBUILDDIR>>/debian/cloud-init/lib/systemd/system
copying tmplpwyipnb/cloud-init-local.service -> /<<PKGBUILDDIR>>/debian/cloud-init/lib/systemd/system
copying tmp1m32in6o/cloud-final.service -> /<<PKGBUILDDIR>>/debian/cloud-init/lib/systemd/system
copying tmpv3pfsk2n/cloud-config.service -> /<<PKGBUILDDIR>>/debian/cloud-init/lib/systemd/system
copying tmpdaxutkgi/cloud-init.service -> /<<PKGBUILDDIR>>/debian/cloud-init/lib/systemd/system
copying systemd/cloud-init.target -> /<<PKGBUILDDIR>>/debian/cloud-init/lib/systemd/system
copying systemd/cloud-config.target -> /<<PKGBUILDDIR>>/debian/cloud-init/lib/systemd/system
running install_egg_info
running egg_info
creating cloud_init.egg-info
writing cloud_init.egg-info/PKG-INFO
writing top-level names to cloud_init.egg-info/top_level.txt
writing requirements to cloud_init.egg-info/requires.txt
writing dependency_links to cloud_init.egg-info/dependency_links.txt
writing entry points to cloud_init.egg-info/entry_points.txt
writing manifest file 'cloud_init.egg-info/SOURCES.txt'
reading manifest file 'cloud_init.egg-info/SOURCES.txt'
reading manifest template 'MANIFEST.in'
no previously-included directories found matching 'build'
no previously-included directories found matching 'dist'
no previously-included directories found matching '.tox'
no previously-included directories found matching '.git'
no previously-included directories found matching '.bzr'
warning: no previously-included files found matching '.gitignore'
warning: no previously-included files found matching '.bzrignore'
writing manifest file 'cloud_init.egg-info/SOURCES.txt'
Copying cloud_init.egg-info to /<<PKGBUILDDIR>>/debian/cloud-init/usr/lib/python3.5/dist-packages/cloud_init-17.1.egg-info
Skipping SOURCES.txt
running install_scripts
copying build/scripts-3.5/cloud-init-per -> /<<PKGBUILDDIR>>/debian/cloud-init/usr/bin
changing mode of /<<PKGBUILDDIR>>/debian/cloud-init/usr/bin/cloud-init-per to 755
Installing cloud-init script to /<<PKGBUILDDIR>>/debian/cloud-init/usr/bin
   debian/rules override_dh_install
make[1]: Entering directory '/<<PKGBUILDDIR>>'
dh_install
install -d debian/cloud-init/etc/rsyslog.d
install -d debian/cloud-init/usr/share/apport/package-hooks
cp tools/21-cloudinit.conf debian/cloud-init/etc/rsyslog.d/21-cloudinit.conf
install -D ./tools/Z99-cloud-locale-test.sh debian/cloud-init/etc/profile.d/Z99-cloud-locale-test.sh
install -D ./tools/Z99-cloudinit-warnings.sh debian/cloud-init/etc/profile.d/Z99-cloudinit-warnings.sh
make[1]: Leaving directory '/<<PKGBUILDDIR>>'
   dh_installdocs -O--buildsystem=pybuild
   dh_installchangelogs -O--buildsystem=pybuild
   dh_installexamples -O--buildsystem=pybuild
   dh_installman -O--buildsystem=pybuild
   dh_installcatalogs -O--buildsystem=pybuild
   dh_installcron -O--buildsystem=pybuild
   dh_installdebconf -O--buildsystem=pybuild
   dh_installemacsen -O--buildsystem=pybuild
   dh_installifupdown -O--buildsystem=pybuild
   dh_installinfo -O--buildsystem=pybuild
   dh_python3 -O--buildsystem=pybuild
   dh_systemd_enable -O--buildsystem=pybuild
   dh_installinit -O--buildsystem=pybuild
   debian/rules override_dh_systemd_start
make[1]: Entering directory '/<<PKGBUILDDIR>>'
dh_systemd_start --no-restart-on-upgrade --no-start
make[1]: Leaving directory '/<<PKGBUILDDIR>>'
   dh_installmenu -O--buildsystem=pybuild
   dh_installmime -O--buildsystem=pybuild
   dh_installmodules -O--buildsystem=pybuild
   dh_installlogcheck -O--buildsystem=pybuild
   dh_installlogrotate -O--buildsystem=pybuild
   dh_installpam -O--buildsystem=pybuild
   dh_installppp -O--buildsystem=pybuild
   dh_installudev -O--buildsystem=pybuild
   dh_installgsettings -O--buildsystem=pybuild
   dh_bugfiles -O--buildsystem=pybuild
   dh_ucf -O--buildsystem=pybuild
   dh_lintian -O--buildsystem=pybuild
   dh_gconf -O--buildsystem=pybuild
   dh_icons -O--buildsystem=pybuild
   dh_perl -O--buildsystem=pybuild
   dh_usrlocal -O--buildsystem=pybuild
   dh_link -O--buildsystem=pybuild
   dh_installwm -O--buildsystem=pybuild
   dh_installxfonts -O--buildsystem=pybuild
   dh_strip_nondeterminism -O--buildsystem=pybuild
   dh_compress -O--buildsystem=pybuild
   dh_fixperms -O--buildsystem=pybuild
   dh_installdeb -O--buildsystem=pybuild
   dh_gencontrol -O--buildsystem=pybuild
dpkg-gencontrol: warning: File::FcntlLock not available; using flock which is not NFS-safe
dpkg-gencontrol: warning: package cloud-init: unknown substitution variable ${python:Versions}
dh_gencontrol debug symbol wrapper: all non-arch-all packages for this build platform amd64: 
dh_gencontrol debug symbol wrapper: packages to act on: 
dh_gencontrol debug symbol wrapper: ignored packages: 
   dh_md5sums -O--buildsystem=pybuild
   dh_builddeb -O--buildsystem=pybuild
pkgstripfiles: processing control file: debian/cloud-init/DEBIAN/control, package cloud-init, directory debian/cloud-init
pkgstripfiles: Running PNG optimization (using 1 cpus) for package cloud-init ...
pkgstripfiles: No PNG files.
dpkg-deb: building package 'cloud-init' in '../cloud-init_17.1-53-gca2ce2ec-1~bddeb_all.deb'.
 dpkg-genchanges -b -mServer Jenkins Bot <server@jenkins.ubuntu.com> >../cloud-init_17.1-53-gca2ce2ec-1~bddeb_amd64.changes
dpkg-genchanges: binary-only upload (no source code included)
 dpkg-source --after-build cloud-init-17.1-53-gca2ce2ec
dpkg-buildpackage: binary-only upload (no source included)
--------------------------------------------------------------------------------
Build finished at 2017-12-07T20:02:47Z

Finished
--------

I: Built successfully

+------------------------------------------------------------------------------+
| Post Build Chroot                                                            |
+------------------------------------------------------------------------------+


+------------------------------------------------------------------------------+
| Changes                                                                      |
+------------------------------------------------------------------------------+


cloud-init_17.1-53-gca2ce2ec-1~bddeb_amd64.changes:
---------------------------------------------------

Format: 1.8
Date: Fri, 16 Dec 2011 11:50:25 -0500
Source: cloud-init
Binary: cloud-init
Architecture: all
Version: 17.1-53-gca2ce2ec-1~bddeb
Distribution: xenial
Urgency: low
Maintainer: Server Jenkins Bot <server@jenkins.ubuntu.com>
Changed-By: Scott Moser <smoser@ubuntu.com>
Description:
 cloud-init - Init scripts for cloud instances
Changes:
 cloud-init (17.1-53-gca2ce2ec-1~bddeb) UNRELEASED; urgency=low
 .
   * build
Checksums-Sha1:
 6389c58ba48c317f5691d4b5c8b59640d6976141 324616 cloud-init_17.1-53-gca2ce2ec-1~bddeb_all.deb
Checksums-Sha256:
 34d154d2be3a847f500a851e9ea7cad0571d88cdb3729e30abe700c411232452 324616 cloud-init_17.1-53-gca2ce2ec-1~bddeb_all.deb
Files:
 f771c6cc8756c2a2845a3f5e8fa696e0 324616 admin optional cloud-init_17.1-53-gca2ce2ec-1~bddeb_all.deb

+------------------------------------------------------------------------------+
| Package contents                                                             |
+------------------------------------------------------------------------------+


cloud-init_17.1-53-gca2ce2ec-1~bddeb_all.deb
--------------------------------------------

 new debian package, version 2.0.
 size 324616 bytes: control archive=9319 bytes.
     920 bytes,    23 lines      conffiles            
     627 bytes,    12 lines      control              
   24016 bytes,   254 lines      md5sums              
    3476 bytes,    83 lines   *  postinst             #!/bin/sh
     797 bytes,    21 lines   *  postrm               #!/bin/sh
     560 bytes,    20 lines   *  preinst              #!/bin/sh
     688 bytes,    17 lines   *  prerm                #!/bin/sh
 Package: cloud-init
 Version: 17.1-53-gca2ce2ec-1~bddeb
 Architecture: all
 Maintainer: Scott Moser <smoser@ubuntu.com>
 Installed-Size: 1573
 Depends: init-system-helpers (>= 1.18~), python3-configobj, python3-jinja2, python3-jsonpatch, python3-jsonschema, python3-oauthlib, python3-requests, python3-six, python3-yaml, python3:any (>= 3.3.2-2~)
 Recommends: eatmydata, sudo, software-properties-common, gdisk
 Section: admin
 Priority: optional
 Description: Init scripts for cloud instances
  Cloud instances need special scripts to run during initialisation
  to retrieve and install ssh keys and to let the user run various scripts.

drwxr-xr-x root/root         0 2017-12-07 20:02 ./
drwxr-xr-x root/root         0 2017-12-07 20:02 ./etc/
drwxr-xr-x root/root         0 2017-12-07 20:02 ./etc/NetworkManager/
drwxr-xr-x root/root         0 2017-12-07 20:02 ./etc/NetworkManager/dispatcher.d/
-rwxr-xr-x root/root       719 2017-12-07 19:38 ./etc/NetworkManager/dispatcher.d/hook-network-manager
drwxr-xr-x root/root         0 2017-12-07 20:02 ./etc/cloud/
-rw-r--r-- root/root      3001 2017-12-07 20:02 ./etc/cloud/cloud.cfg
drwxr-xr-x root/root         0 2017-12-07 20:02 ./etc/cloud/cloud.cfg.d/
-rw-r--r-- root/root      2057 2017-12-07 19:38 ./etc/cloud/cloud.cfg.d/05_logging.cfg
-rw-r--r-- root/root       141 2017-12-07 19:38 ./etc/cloud/cloud.cfg.d/README
drwxr-xr-x root/root         0 2017-12-07 20:02 ./etc/cloud/templates/
-rw-r--r-- root/root      1488 2017-12-07 19:38 ./etc/cloud/templates/chef_client.rb.tmpl
-rw-r--r-- root/root       901 2017-12-07 19:38 ./etc/cloud/templates/hosts.debian.tmpl
-rw-r--r-- root/root       914 2017-12-07 19:38 ./etc/cloud/templates/hosts.freebsd.tmpl
-rw-r--r-- root/root       912 2017-12-07 19:38 ./etc/cloud/templates/hosts.redhat.tmpl
-rw-r--r-- root/root      1067 2017-12-07 19:38 ./etc/cloud/templates/hosts.suse.tmpl
-rw-r--r-- root/root      2150 2017-12-07 19:38 ./etc/cloud/templates/ntp.conf.debian.tmpl
-rw-r--r-- root/root      2074 2017-12-07 19:38 ./etc/cloud/templates/ntp.conf.fedora.tmpl
-rw-r--r-- root/root      2755 2017-12-07 19:38 ./etc/cloud/templates/ntp.conf.opensuse.tmpl
-rw-r--r-- root/root      1852 2017-12-07 19:38 ./etc/cloud/templates/ntp.conf.rhel.tmpl
-rw-r--r-- root/root      2755 2017-12-07 19:38 ./etc/cloud/templates/ntp.conf.sles.tmpl
-rw-r--r-- root/root      2509 2017-12-07 19:38 ./etc/cloud/templates/ntp.conf.ubuntu.tmpl
-rw-r--r-- root/root       812 2017-12-07 19:38 ./etc/cloud/templates/resolv.conf.tmpl
-rw-r--r-- root/root      1295 2017-12-07 19:38 ./etc/cloud/templates/sources.list.debian.tmpl
-rw-r--r-- root/root      2841 2017-12-07 19:38 ./etc/cloud/templates/sources.list.ubuntu.tmpl
-rw-r--r-- root/root       203 2017-12-07 19:38 ./etc/cloud/templates/timesyncd.conf.tmpl
drwxr-xr-x root/root         0 2017-12-07 20:02 ./etc/dhcp/
drwxr-xr-x root/root         0 2017-12-07 20:02 ./etc/dhcp/dhclient-exit-hooks.d/
-rwxr-xr-x root/root       805 2017-12-07 19:38 ./etc/dhcp/dhclient-exit-hooks.d/hook-dhclient
drwxr-xr-x root/root         0 2017-12-07 20:02 ./etc/profile.d/
-rwxr-xr-x root/root      3308 2017-12-07 20:02 ./etc/profile.d/Z99-cloud-locale-test.sh
-rwxr-xr-x root/root       775 2017-12-07 20:02 ./etc/profile.d/Z99-cloudinit-warnings.sh
drwxr-xr-x root/root         0 2017-12-07 20:02 ./etc/rsyslog.d/
-rw-r--r-- root/root       255 2017-12-07 20:02 ./etc/rsyslog.d/21-cloudinit.conf
drwxr-xr-x root/root         0 2017-12-07 20:02 ./lib/
drwxr-xr-x root/root         0 2017-12-07 20:02 ./lib/systemd/
drwxr-xr-x root/root         0 2017-12-07 20:02 ./lib/systemd/system-generators/
-rwxr-xr-x root/root      4911 2017-12-07 19:38 ./lib/systemd/system-generators/cloud-init-generator
drwxr-xr-x root/root         0 2017-12-07 20:02 ./lib/systemd/system/
-rw-r--r-- root/root       391 2017-12-07 20:02 ./lib/systemd/system/cloud-config.service
-rw-r--r-- root/root       536 2017-12-07 19:38 ./lib/systemd/system/cloud-config.target
-rw-r--r-- root/root       482 2017-12-07 20:02 ./lib/systemd/system/cloud-final.service
-rw-r--r-- root/root       580 2017-12-07 20:02 ./lib/systemd/system/cloud-init-local.service
-rw-r--r-- root/root       642 2017-12-07 20:02 ./lib/systemd/system/cloud-init.service
-rw-r--r-- root/root       256 2017-12-07 19:38 ./lib/systemd/system/cloud-init.target
drwxr-xr-x root/root         0 2017-12-07 20:02 ./lib/udev/
drwxr-xr-x root/root         0 2017-12-07 20:02 ./lib/udev/rules.d/
-rw-r--r-- root/root       734 2017-12-07 19:38 ./lib/udev/rules.d/66-azure-ephemeral.rules
drwxr-xr-x root/root         0 2017-12-07 20:02 ./usr/
drwxr-xr-x root/root         0 2017-12-07 20:02 ./usr/bin/
-rwxr-xr-x root/root       314 2017-12-07 20:02 ./usr/bin/cloud-init
-rwxr-xr-x root/root      1781 2017-12-07 19:38 ./usr/bin/cloud-init-per
drwxr-xr-x root/root         0 2017-12-07 20:02 ./usr/lib/
drwxr-xr-x root/root         0 2017-12-07 20:02 ./usr/lib/cloud-init/
-rwxr-xr-x root/root     37585 2017-12-07 19:38 ./usr/lib/cloud-init/ds-identify
-rwxr-xr-x root/root      4116 2017-12-07 19:38 ./usr/lib/cloud-init/uncloud-init
-rwxr-xr-x root/root      1135 2017-12-07 19:38 ./usr/lib/cloud-init/write-ssh-key-fingerprints
drwxr-xr-x root/root         0 2017-12-07 20:02 ./usr/lib/python3/
drwxr-xr-x root/root         0 2017-12-07 20:02 ./usr/lib/python3/dist-packages/
drwxr-xr-x root/root         0 2017-12-07 20:02 ./usr/lib/python3/dist-packages/cloud_init-17.1.egg-info/
-rw-r--r-- root/root       279 2017-12-07 20:02 ./usr/lib/python3/dist-packages/cloud_init-17.1.egg-info/PKG-INFO
-rw-r--r-- root/root         1 2017-12-07 20:02 ./usr/lib/python3/dist-packages/cloud_init-17.1.egg-info/dependency_links.txt
-rw-r--r-- root/root        56 2017-12-07 20:02 ./usr/lib/python3/dist-packages/cloud_init-17.1.egg-info/entry_points.txt
-rw-r--r-- root/root         0 2017-12-07 20:02 ./usr/lib/python3/dist-packages/cloud_init-17.1.egg-info/requires.txt
-rw-r--r-- root/root        10 2017-12-07 20:02 ./usr/lib/python3/dist-packages/cloud_init-17.1.egg-info/top_level.txt
drwxr-xr-x root/root         0 2017-12-07 20:02 ./usr/lib/python3/dist-packages/cloudinit/
-rw-r--r-- root/root         0 2017-12-07 19:38 ./usr/lib/python3/dist-packages/cloudinit/__init__.py
drwxr-xr-x root/root         0 2017-12-07 20:02 ./usr/lib/python3/dist-packages/cloudinit/analyze/
-rw-r--r-- root/root         0 2017-12-07 19:38 ./usr/lib/python3/dist-packages/cloudinit/analyze/__init__.py
-rw-r--r-- root/root      5641 2017-12-07 19:38 ./usr/lib/python3/dist-packages/cloudinit/analyze/__main__.py
-rw-r--r-- root/root      5554 2017-12-07 19:38 ./usr/lib/python3/dist-packages/cloudinit/analyze/dump.py
-rw-r--r-- root/root      5628 2017-12-07 19:38 ./usr/lib/python3/dist-packages/cloudinit/analyze/show.py
-rw-r--r-- root/root      3858 2017-12-07 19:38 ./usr/lib/python3/dist-packages/cloudinit/apport.py
-rw-r--r-- root/root      1120 2017-12-07 19:38 ./usr/lib/python3/dist-packages/cloudinit/atomic_helper.py
-rw-r--r-- root/root      3155 2017-12-07 19:38 ./usr/lib/python3/dist-packages/cloudinit/cloud.py
drwxr-xr-x root/root         0 2017-12-07 20:02 ./usr/lib/python3/dist-packages/cloudinit/cmd/
-rw-r--r-- root/root         0 2017-12-07 19:38 ./usr/lib/python3/dist-packages/cloudinit/cmd/__init__.py
-rw-r--r-- root/root      3290 2017-12-07 19:38 ./usr/lib/python3/dist-packages/cloudinit/cmd/clean.py
drwxr-xr-x root/root         0 2017-12-07 20:02 ./usr/lib/python3/dist-packages/cloudinit/cmd/devel/
-rw-r--r-- root/root         0 2017-12-07 19:38 ./usr/lib/python3/dist-packages/cloudinit/cmd/devel/__init__.py
-rw-r--r-- root/root      3566 2017-12-07 19:38 ./usr/lib/python3/dist-packages/cloudinit/cmd/devel/logs.py
-rw-r--r-- root/root       881 2017-12-07 19:38 ./usr/lib/python3/dist-packages/cloudinit/cmd/devel/parser.py
-rw-r--r-- root/root     31031 2017-12-07 19:38 ./usr/lib/python3/dist-packages/cloudinit/cmd/main.py
-rw-r--r-- root/root      5202 2017-12-07 19:38 ./usr/lib/python3/dist-packages/cloudinit/cmd/status.py
drwxr-xr-x root/root         0 2017-12-07 20:02 ./usr/lib/python3/dist-packages/cloudinit/config/
-rw-r--r-- root/root      1437 2017-12-07 19:38 ./usr/lib/python3/dist-packages/cloudinit/config/__init__.py
-rw-r--r-- root/root     33502 2017-12-07 19:38 ./usr/lib/python3/dist-packages/cloudinit/config/cc_apt_configure.py
-rw-r--r-- root/root      2491 2017-12-07 19:38 ./usr/lib/python3/dist-packages/cloudinit/config/cc_apt_pipelining.py
-rw-r--r-- root/root      3455 2017-12-07 19:38 ./usr/lib/python3/dist-packages/cloudinit/config/cc_bootcmd.py
-rw-r--r-- root/root      3164 2017-12-07 19:38 ./usr/lib/python3/dist-packages/cloudinit/config/cc_byobu.py
-rw-r--r-- root/root      4190 2017-12-07 19:38 ./usr/lib/python3/dist-packages/cloudinit/config/cc_ca_certs.py
-rw-r--r-- root/root     13369 2017-12-07 19:38 ./usr/lib/python3/dist-packages/cloudinit/config/cc_chef.py
-rw-r--r-- root/root      3121 2017-12-07 19:38 ./usr/lib/python3/dist-packages/cloudinit/config/cc_debug.py
-rw-r--r-- root/root      1198 2017-12-07 19:38 ./usr/lib/python3/dist-packages/cloudinit/config/cc_disable_ec2_metadata.py
-rw-r--r-- root/root     33579 2017-12-07 19:38 ./usr/lib/python3/dist-packages/cloudinit/config/cc_disk_setup.py
-rw-r--r-- root/root      2046 2017-12-07 19:38 ./usr/lib/python3/dist-packages/cloudinit/config/cc_emit_upstart.py
-rw-r--r-- root/root      2893 2017-12-07 19:38 ./usr/lib/python3/dist-packages/cloudinit/config/cc_fan.py
-rw-r--r-- root/root      2403 2017-12-07 19:38 ./usr/lib/python3/dist-packages/cloudinit/config/cc_final_message.py
-rw-r--r-- root/root      2116 2017-12-07 19:38 ./usr/lib/python3/dist-packages/cloudinit/config/cc_foo.py
-rw-r--r-- root/root     11715 2017-12-07 19:38 ./usr/lib/python3/dist-packages/cloudinit/config/cc_growpart.py
-rw-r--r-- root/root      2940 2017-12-07 19:38 ./usr/lib/python3/dist-packages/cloudinit/config/cc_grub_dpkg.py
-rw-r--r-- root/root      2446 2017-12-07 19:38 ./usr/lib/python3/dist-packages/cloudinit/config/cc_keys_to_console.py
-rw-r--r-- root/root      4056 2017-12-07 19:38 ./usr/lib/python3/dist-packages/cloudinit/config/cc_landscape.py
-rw-r--r-- root/root      1187 2017-12-07 19:38 ./usr/lib/python3/dist-packages/cloudinit/config/cc_locale.py
-rw-r--r-- root/root      8676 2017-12-07 19:38 ./usr/lib/python3/dist-packages/cloudinit/config/cc_lxd.py
-rw-r--r-- root/root      5204 2017-12-07 19:38 ./usr/lib/python3/dist-packages/cloudinit/config/cc_mcollective.py
-rw-r--r-- root/root      3148 2017-12-07 19:38 ./usr/lib/python3/dist-packages/cloudinit/config/cc_migrator.py
-rw-r--r-- root/root     15886 2017-12-07 19:38 ./usr/lib/python3/dist-packages/cloudinit/config/cc_mounts.py
-rw-r--r-- root/root      7313 2017-12-07 19:38 ./usr/lib/python3/dist-packages/cloudinit/config/cc_ntp.py
-rw-r--r-- root/root      4172 2017-12-07 19:38 ./usr/lib/python3/dist-packages/cloudinit/config/cc_package_update_upgrade_install.py
-rw-r--r-- root/root      3987 2017-12-07 19:38 ./usr/lib/python3/dist-packages/cloudinit/config/cc_phone_home.py
-rw-r--r-- root/root      7808 2017-12-07 19:38 ./usr/lib/python3/dist-packages/cloudinit/config/cc_power_state_change.py
-rw-r--r-- root/root      6650 2017-12-07 19:38 ./usr/lib/python3/dist-packages/cloudinit/config/cc_puppet.py
-rw-r--r-- root/root      9159 2017-12-07 19:38 ./usr/lib/python3/dist-packages/cloudinit/config/cc_resizefs.py
-rw-r--r-- root/root      3503 2017-12-07 19:38 ./usr/lib/python3/dist-packages/cloudinit/config/cc_resolv_conf.py
-rw-r--r-- root/root     16383 2017-12-07 19:38 ./usr/lib/python3/dist-packages/cloudinit/config/cc_rh_subscription.py
-rw-r--r-- root/root      3843 2017-12-07 19:38 ./usr/lib/python3/dist-packages/cloudinit/config/cc_rightscale_userdata.py
-rw-r--r-- root/root     14433 2017-12-07 19:38 ./usr/lib/python3/dist-packages/cloudinit/config/cc_rsyslog.py
-rw-r--r-- root/root      3047 2017-12-07 19:38 ./usr/lib/python3/dist-packages/cloudinit/config/cc_runcmd.py
-rw-r--r-- root/root      2924 2017-12-07 19:38 ./usr/lib/python3/dist-packages/cloudinit/config/cc_salt_minion.py
-rw-r--r-- root/root      1226 2017-12-07 19:38 ./usr/lib/python3/dist-packages/cloudinit/config/cc_scripts_per_boot.py
-rw-r--r-- root/root      1264 2017-12-07 19:38 ./usr/lib/python3/dist-packages/cloudinit/config/cc_scripts_per_instance.py
-rw-r--r-- root/root      1202 2017-12-07 19:38 ./usr/lib/python3/dist-packages/cloudinit/config/cc_scripts_per_once.py
-rw-r--r-- root/root      1450 2017-12-07 19:38 ./usr/lib/python3/dist-packages/cloudinit/config/cc_scripts_user.py
-rw-r--r-- root/root      1412 2017-12-07 19:38 ./usr/lib/python3/dist-packages/cloudinit/config/cc_scripts_vendor.py
-rw-r--r-- root/root      4460 2017-12-07 19:38 ./usr/lib/python3/dist-packages/cloudinit/config/cc_seed_random.py
-rw-r--r-- root/root      1690 2017-12-07 19:38 ./usr/lib/python3/dist-packages/cloudinit/config/cc_set_hostname.py
-rw-r--r-- root/root      8320 2017-12-07 19:38 ./usr/lib/python3/dist-packages/cloudinit/config/cc_set_passwords.py
-rw-r--r-- root/root      5134 2017-12-07 19:38 ./usr/lib/python3/dist-packages/cloudinit/config/cc_snap_config.py
-rw-r--r-- root/root      9617 2017-12-07 19:38 ./usr/lib/python3/dist-packages/cloudinit/config/cc_snappy.py
-rw-r--r-- root/root      2957 2017-12-07 19:38 ./usr/lib/python3/dist-packages/cloudinit/config/cc_spacewalk.py
-rw-r--r-- root/root      8337 2017-12-07 19:38 ./usr/lib/python3/dist-packages/cloudinit/config/cc_ssh.py
-rw-r--r-- root/root      3550 2017-12-07 19:38 ./usr/lib/python3/dist-packages/cloudinit/config/cc_ssh_authkey_fingerprints.py
-rw-r--r-- root/root      2951 2017-12-07 19:38 ./usr/lib/python3/dist-packages/cloudinit/config/cc_ssh_import_id.py
-rw-r--r-- root/root      1175 2017-12-07 19:38 ./usr/lib/python3/dist-packages/cloudinit/config/cc_timezone.py
-rw-r--r-- root/root      3400 2017-12-07 19:38 ./usr/lib/python3/dist-packages/cloudinit/config/cc_update_etc_hosts.py
-rw-r--r-- root/root      1617 2017-12-07 19:38 ./usr/lib/python3/dist-packages/cloudinit/config/cc_update_hostname.py
-rw-r--r-- root/root      4989 2017-12-07 19:38 ./usr/lib/python3/dist-packages/cloudinit/config/cc_users_groups.py
-rw-r--r-- root/root      4634 2017-12-07 19:38 ./usr/lib/python3/dist-packages/cloudinit/config/cc_write_files.py
-rw-r--r-- root/root      4359 2017-12-07 19:38 ./usr/lib/python3/dist-packages/cloudinit/config/cc_yum_add_repo.py
-rw-r--r-- root/root      7799 2017-12-07 19:38 ./usr/lib/python3/dist-packages/cloudinit/config/cc_zypper_add_repo.py
-rw-r--r-- root/root     13274 2017-12-07 19:38 ./usr/lib/python3/dist-packages/cloudinit/config/schema.py
-rw-r--r-- root/root      3074 2017-12-07 19:38 ./usr/lib/python3/dist-packages/cloudinit/cs_utils.py
-rw-r--r-- root/root      1609 2017-12-07 19:38 ./usr/lib/python3/dist-packages/cloudinit/dhclient_hook.py
drwxr-xr-x root/root         0 2017-12-07 20:02 ./usr/lib/python3/dist-packages/cloudinit/distros/
-rw-r--r-- root/root     27946 2017-12-07 19:38 ./usr/lib/python3/dist-packages/cloudinit/distros/__init__.py
-rw-r--r-- root/root      7220 2017-12-07 19:38 ./usr/lib/python3/dist-packages/cloudinit/distros/arch.py
-rw-r--r-- root/root       245 2017-12-07 19:38 ./usr/lib/python3/dist-packages/cloudinit/distros/centos.py
-rw-r--r-- root/root     10276 2017-12-07 19:38 ./usr/lib/python3/dist-packages/cloudinit/distros/debian.py
-rw-r--r-- root/root       532 2017-12-07 19:38 ./usr/lib/python3/dist-packages/cloudinit/distros/fedora.py
-rw-r--r-- root/root     23045 2017-12-07 19:38 ./usr/lib/python3/dist-packages/cloudinit/distros/freebsd.py
-rw-r--r-- root/root      8221 2017-12-07 19:38 ./usr/lib/python3/dist-packages/cloudinit/distros/gentoo.py
-rw-r--r-- root/root      5762 2017-12-07 19:38 ./usr/lib/python3/dist-packages/cloudinit/distros/net_util.py
-rw-r--r-- root/root      7762 2017-12-07 19:38 ./usr/lib/python3/dist-packages/cloudinit/distros/opensuse.py
drwxr-xr-x root/root         0 2017-12-07 20:02 ./usr/lib/python3/dist-packages/cloudinit/distros/parsers/
-rw-r--r-- root/root       562 2017-12-07 19:38 ./usr/lib/python3/dist-packages/cloudinit/distros/parsers/__init__.py
-rw-r--r-- root/root      2532 2017-12-07 19:38 ./usr/lib/python3/dist-packages/cloudinit/distros/parsers/hostname.py
-rw-r--r-- root/root      2769 2017-12-07 19:38 ./usr/lib/python3/dist-packages/cloudinit/distros/parsers/hosts.py
-rw-r--r-- root/root       734 2017-12-07 19:38 ./usr/lib/python3/dist-packages/cloudinit/distros/parsers/networkmanager_conf.py
-rw-r--r-- root/root      5468 2017-12-07 19:38 ./usr/lib/python3/dist-packages/cloudinit/distros/parsers/resolv_conf.py
-rw-r--r-- root/root      3679 2017-12-07 19:38 ./usr/lib/python3/dist-packages/cloudinit/distros/parsers/sys_conf.py
-rw-r--r-- root/root      8545 2017-12-07 19:38 ./usr/lib/python3/dist-packages/cloudinit/distros/rhel.py
-rw-r--r-- root/root      2390 2017-12-07 19:38 ./usr/lib/python3/dist-packages/cloudinit/distros/rhel_util.py
-rw-r--r-- root/root       342 2017-12-07 19:38 ./usr/lib/python3/dist-packages/cloudinit/distros/sles.py
-rw-r--r-- root/root       583 2017-12-07 19:38 ./usr/lib/python3/dist-packages/cloudinit/distros/ubuntu.py
-rw-r--r-- root/root     11209 2017-12-07 19:38 ./usr/lib/python3/dist-packages/cloudinit/distros/ug_util.py
-rw-r--r-- root/root      6994 2017-12-07 19:38 ./usr/lib/python3/dist-packages/cloudinit/ec2_utils.py
drwxr-xr-x root/root         0 2017-12-07 20:02 ./usr/lib/python3/dist-packages/cloudinit/filters/
-rw-r--r-- root/root         0 2017-12-07 19:38 ./usr/lib/python3/dist-packages/cloudinit/filters/__init__.py
-rw-r--r-- root/root      2164 2017-12-07 19:38 ./usr/lib/python3/dist-packages/cloudinit/filters/launch_index.py
-rw-r--r-- root/root      2107 2017-12-07 19:38 ./usr/lib/python3/dist-packages/cloudinit/gpg.py
drwxr-xr-x root/root         0 2017-12-07 20:02 ./usr/lib/python3/dist-packages/cloudinit/handlers/
-rw-r--r-- root/root      8939 2017-12-07 19:38 ./usr/lib/python3/dist-packages/cloudinit/handlers/__init__.py
-rw-r--r-- root/root      2066 2017-12-07 19:38 ./usr/lib/python3/dist-packages/cloudinit/handlers/boot_hook.py
-rw-r--r-- root/root      5500 2017-12-07 19:38 ./usr/lib/python3/dist-packages/cloudinit/handlers/cloud_config.py
-rw-r--r-- root/root      1408 2017-12-07 19:38 ./usr/lib/python3/dist-packages/cloudinit/handlers/shell_script.py
-rw-r--r-- root/root      3402 2017-12-07 19:38 ./usr/lib/python3/dist-packages/cloudinit/handlers/upstart_job.py
-rw-r--r-- root/root     14844 2017-12-07 19:38 ./usr/lib/python3/dist-packages/cloudinit/helpers.py
-rw-r--r-- root/root      1416 2017-12-07 19:38 ./usr/lib/python3/dist-packages/cloudinit/importer.py
-rw-r--r-- root/root      4187 2017-12-07 19:38 ./usr/lib/python3/dist-packages/cloudinit/log.py
drwxr-xr-x root/root         0 2017-12-07 20:02 ./usr/lib/python3/dist-packages/cloudinit/mergers/
-rw-r--r-- root/root      5348 2017-12-07 19:38 ./usr/lib/python3/dist-packages/cloudinit/mergers/__init__.py
-rw-r--r-- root/root      2656 2017-12-07 19:38 ./usr/lib/python3/dist-packages/cloudinit/mergers/m_dict.py
-rw-r--r-- root/root      2849 2017-12-07 19:38 ./usr/lib/python3/dist-packages/cloudinit/mergers/m_list.py
-rw-r--r-- root/root      1146 2017-12-07 19:38 ./usr/lib/python3/dist-packages/cloudinit/mergers/m_str.py
drwxr-xr-x root/root         0 2017-12-07 20:02 ./usr/lib/python3/dist-packages/cloudinit/net/
-rw-r--r-- root/root     22564 2017-12-07 19:38 ./usr/lib/python3/dist-packages/cloudinit/net/__init__.py
-rw-r--r-- root/root      6052 2017-12-07 19:38 ./usr/lib/python3/dist-packages/cloudinit/net/cmdline.py
-rw-r--r-- root/root      6754 2017-12-07 19:38 ./usr/lib/python3/dist-packages/cloudinit/net/dhcp.py
-rw-r--r-- root/root     18896 2017-12-07 19:38 ./usr/lib/python3/dist-packages/cloudinit/net/eni.py
-rw-r--r-- root/root     14513 2017-12-07 19:38 ./usr/lib/python3/dist-packages/cloudinit/net/netplan.py
-rw-r--r-- root/root     30941 2017-12-07 19:38 ./usr/lib/python3/dist-packages/cloudinit/net/network_state.py
-rw-r--r-- root/root      1793 2017-12-07 19:38 ./usr/lib/python3/dist-packages/cloudinit/net/renderer.py
-rw-r--r-- root/root      1384 2017-12-07 19:38 ./usr/lib/python3/dist-packages/cloudinit/net/renderers.py
-rw-r--r-- root/root     25488 2017-12-07 19:38 ./usr/lib/python3/dist-packages/cloudinit/net/sysconfig.py
-rw-r--r-- root/root      1417 2017-12-07 19:38 ./usr/lib/python3/dist-packages/cloudinit/net/udev.py
-rw-r--r-- root/root      8348 2017-12-07 19:38 ./usr/lib/python3/dist-packages/cloudinit/netinfo.py
-rw-r--r-- root/root      1261 2017-12-07 19:38 ./usr/lib/python3/dist-packages/cloudinit/patcher.py
-rw-r--r-- root/root      1039 2017-12-07 19:38 ./usr/lib/python3/dist-packages/cloudinit/registry.py
drwxr-xr-x root/root         0 2017-12-07 20:02 ./usr/lib/python3/dist-packages/cloudinit/reporting/
-rw-r--r-- root/root      1313 2017-12-07 19:38 ./usr/lib/python3/dist-packages/cloudinit/reporting/__init__.py
-rw-r--r-- root/root      7806 2017-12-07 19:38 ./usr/lib/python3/dist-packages/cloudinit/reporting/events.py
-rw-r--r-- root/root      2902 2017-12-07 19:38 ./usr/lib/python3/dist-packages/cloudinit/reporting/handlers.py
-rw-r--r-- root/root       533 2017-12-07 19:38 ./usr/lib/python3/dist-packages/cloudinit/safeyaml.py
-rw-r--r-- root/root      1214 2017-12-07 19:38 ./usr/lib/python3/dist-packages/cloudinit/serial.py
-rw-r--r-- root/root      1750 2017-12-07 19:38 ./usr/lib/python3/dist-packages/cloudinit/settings.py
-rw-r--r-- root/root      1846 2017-12-07 19:38 ./usr/lib/python3/dist-packages/cloudinit/signal_handler.py
-rw-r--r-- root/root      1899 2017-12-07 19:38 ./usr/lib/python3/dist-packages/cloudinit/simpletable.py
drwxr-xr-x root/root         0 2017-12-07 20:02 ./usr/lib/python3/dist-packages/cloudinit/sources/
-rw-r--r-- root/root      2139 2017-12-07 19:38 ./usr/lib/python3/dist-packages/cloudinit/sources/DataSourceAliYun.py
-rw-r--r-- root/root      8389 2017-12-07 19:38 ./usr/lib/python3/dist-packages/cloudinit/sources/DataSourceAltCloud.py
-rw-r--r-- root/root     30302 2017-12-07 19:38 ./usr/lib/python3/dist-packages/cloudinit/sources/DataSourceAzure.py
-rw-r--r-- root/root      1769 2017-12-07 19:38 ./usr/lib/python3/dist-packages/cloudinit/sources/DataSourceBigstep.py
-rw-r--r-- root/root      3924 2017-12-07 19:38 ./usr/lib/python3/dist-packages/cloudinit/sources/DataSourceCloudSigma.py
-rw-r--r-- root/root      9545 2017-12-07 19:38 ./usr/lib/python3/dist-packages/cloudinit/sources/DataSourceCloudStack.py
-rw-r--r-- root/root      9683 2017-12-07 19:38 ./usr/lib/python3/dist-packages/cloudinit/sources/DataSourceConfigDrive.py
-rw-r--r-- root/root      3788 2017-12-07 19:38 ./usr/lib/python3/dist-packages/cloudinit/sources/DataSourceDigitalOcean.py
-rw-r--r-- root/root     19423 2017-12-07 19:38 ./usr/lib/python3/dist-packages/cloudinit/sources/DataSourceEc2.py
-rw-r--r-- root/root      7746 2017-12-07 19:38 ./usr/lib/python3/dist-packages/cloudinit/sources/DataSourceGCE.py
-rw-r--r-- root/root     13216 2017-12-07 19:38 ./usr/lib/python3/dist-packages/cloudinit/sources/DataSourceMAAS.py
-rw-r--r-- root/root     11578 2017-12-07 19:38 ./usr/lib/python3/dist-packages/cloudinit/sources/DataSourceNoCloud.py
-rw-r--r-- root/root      1345 2017-12-07 19:38 ./usr/lib/python3/dist-packages/cloudinit/sources/DataSourceNone.py
-rw-r--r-- root/root     19593 2017-12-07 19:38 ./usr/lib/python3/dist-packages/cloudinit/sources/DataSourceOVF.py
-rw-r--r-- root/root     13053 2017-12-07 19:38 ./usr/lib/python3/dist-packages/cloudinit/sources/DataSourceOpenNebula.py
-rw-r--r-- root/root      5825 2017-12-07 19:38 ./usr/lib/python3/dist-packages/cloudinit/sources/DataSourceOpenStack.py
-rw-r--r-- root/root      7510 2017-12-07 19:38 ./usr/lib/python3/dist-packages/cloudinit/sources/DataSourceScaleway.py
-rw-r--r-- root/root     28822 2017-12-07 19:38 ./usr/lib/python3/dist-packages/cloudinit/sources/DataSourceSmartOS.py
-rw-r--r-- root/root     17872 2017-12-07 19:38 ./usr/lib/python3/dist-packages/cloudinit/sources/__init__.py
drwxr-xr-x root/root         0 2017-12-07 20:02 ./usr/lib/python3/dist-packages/cloudinit/sources/helpers/
-rw-r--r-- root/root         0 2017-12-07 19:38 ./usr/lib/python3/dist-packages/cloudinit/sources/helpers/__init__.py
-rw-r--r-- root/root     13178 2017-12-07 19:38 ./usr/lib/python3/dist-packages/cloudinit/sources/helpers/azure.py
-rw-r--r-- root/root      7206 2017-12-07 19:38 ./usr/lib/python3/dist-packages/cloudinit/sources/helpers/digitalocean.py
-rw-r--r-- root/root     23208 2017-12-07 19:38 ./usr/lib/python3/dist-packages/cloudinit/sources/helpers/openstack.py
drwxr-xr-x root/root         0 2017-12-07 20:02 ./usr/lib/python3/dist-packages/cloudinit/sources/helpers/vmware/
-rw-r--r-- root/root         0 2017-12-07 19:38 ./usr/lib/python3/dist-packages/cloudinit/sources/helpers/vmware/__init__.py
drwxr-xr-x root/root         0 2017-12-07 20:02 ./usr/lib/python3/dist-packages/cloudinit/sources/helpers/vmware/imc/
-rw-r--r-- root/root         0 2017-12-07 19:38 ./usr/lib/python3/dist-packages/cloudinit/sources/helpers/vmware/imc/__init__.py
-rw-r--r-- root/root       338 2017-12-07 19:38 ./usr/lib/python3/dist-packages/cloudinit/sources/helpers/vmware/imc/boot_proto.py
-rw-r--r-- root/root      2855 2017-12-07 19:38 ./usr/lib/python3/dist-packages/cloudinit/sources/helpers/vmware/imc/config.py
-rw-r--r-- root/root      3291 2017-12-07 19:38 ./usr/lib/python3/dist-packages/cloudinit/sources/helpers/vmware/imc/config_file.py
-rw-r--r-- root/root       354 2017-12-07 19:38 ./usr/lib/python3/dist-packages/cloudinit/sources/helpers/vmware/imc/config_namespace.py
-rw-r--r-- root/root      8774 2017-12-07 19:38 ./usr/lib/python3/dist-packages/cloudinit/sources/helpers/vmware/imc/config_nic.py
-rw-r--r-- root/root      2387 2017-12-07 19:38 ./usr/lib/python3/dist-packages/cloudinit/sources/helpers/vmware/imc/config_passwd.py
-rw-r--r-- root/root       315 2017-12-07 19:38 ./usr/lib/python3/dist-packages/cloudinit/sources/helpers/vmware/imc/config_source.py
-rw-r--r-- root/root       359 2017-12-07 19:38 ./usr/lib/python3/dist-packages/cloudinit/sources/helpers/vmware/imc/guestcust_error.py
-rw-r--r-- root/root       491 2017-12-07 19:38 ./usr/lib/python3/dist-packages/cloudinit/sources/helpers/vmware/imc/guestcust_event.py
-rw-r--r-- root/root       388 2017-12-07 19:38 ./usr/lib/python3/dist-packages/cloudinit/sources/helpers/vmware/imc/guestcust_state.py
-rw-r--r-- root/root      3356 2017-12-07 19:38 ./usr/lib/python3/dist-packages/cloudinit/sources/helpers/vmware/imc/guestcust_util.py
-rw-r--r-- root/root      1127 2017-12-07 19:38 ./usr/lib/python3/dist-packages/cloudinit/sources/helpers/vmware/imc/ipv4_mode.py
-rw-r--r-- root/root      3221 2017-12-07 19:38 ./usr/lib/python3/dist-packages/cloudinit/sources/helpers/vmware/imc/nic.py
-rw-r--r-- root/root      3917 2017-12-07 19:38 ./usr/lib/python3/dist-packages/cloudinit/sources/helpers/vmware/imc/nic_base.py
-rw-r--r-- root/root     10307 2017-12-07 19:38 ./usr/lib/python3/dist-packages/cloudinit/ssh_util.py
-rw-r--r-- root/root     35026 2017-12-07 19:38 ./usr/lib/python3/dist-packages/cloudinit/stages.py
-rw-r--r-- root/root      2754 2017-12-07 19:38 ./usr/lib/python3/dist-packages/cloudinit/temp_utils.py
-rw-r--r-- root/root      5425 2017-12-07 19:38 ./usr/lib/python3/dist-packages/cloudinit/templater.py
-rw-r--r-- root/root       945 2017-12-07 19:38 ./usr/lib/python3/dist-packages/cloudinit/type_utils.py
-rw-r--r-- root/root     17451 2017-12-07 19:38 ./usr/lib/python3/dist-packages/cloudinit/url_helper.py
-rw-r--r-- root/root     13685 2017-12-07 19:38 ./usr/lib/python3/dist-packages/cloudinit/user_data.py
-rw-r--r-- root/root     79772 2017-12-07 19:38 ./usr/lib/python3/dist-packages/cloudinit/util.py
-rw-r--r-- root/root       410 2017-12-07 19:38 ./usr/lib/python3/dist-packages/cloudinit/version.py
-rw-r--r-- root/root      3917 2017-12-07 19:38 ./usr/lib/python3/dist-packages/cloudinit/warnings.py
drwxr-xr-x root/root         0 2017-12-07 20:02 ./usr/share/
drwxr-xr-x root/root         0 2017-12-07 20:02 ./usr/share/apport/
drwxr-xr-x root/root         0 2017-12-07 20:02 ./usr/share/apport/package-hooks/
drwxr-xr-x root/root         0 2017-12-07 20:02 ./usr/share/doc/
drwxr-xr-x root/root         0 2017-12-07 20:02 ./usr/share/doc/cloud-init/
-rw-r--r-- root/root       134 2017-12-07 19:38 ./usr/share/doc/cloud-init/README
-rw-r--r-- root/root       151 2017-12-07 20:01 ./usr/share/doc/cloud-init/changelog.Debian.gz
-rw-r--r-- root/root      1630 2017-12-07 20:01 ./usr/share/doc/cloud-init/copyright
drwxr-xr-x root/root         0 2017-12-07 20:02 ./usr/share/doc/cloud-init/examples/
-rw-r--r-- root/root      1444 2017-12-07 19:38 ./usr/share/doc/cloud-init/examples/cloud-config-add-apt-repos.txt
-rw-r--r-- root/root      5033 2017-12-07 19:38 ./usr/share/doc/cloud-init/examples/cloud-config-apt.txt.gz
-rw-r--r-- root/root       802 2017-12-07 19:38 ./usr/share/doc/cloud-init/examples/cloud-config-archive-launch-index.txt
-rw-r--r-- root/root       244 2017-12-07 19:38 ./usr/share/doc/cloud-init/examples/cloud-config-archive.txt
-rw-r--r-- root/root       634 2017-12-07 19:38 ./usr/share/doc/cloud-init/examples/cloud-config-boot-cmds.txt
-rw-r--r-- root/root      1096 2017-12-07 19:38 ./usr/share/doc/cloud-init/examples/cloud-config-ca-certs.txt
-rw-r--r-- root/root      3514 2017-12-07 19:38 ./usr/share/doc/cloud-init/examples/cloud-config-chef-oneiric.txt
-rw-r--r-- root/root      4046 2017-12-07 19:38 ./usr/share/doc/cloud-init/examples/cloud-config-chef.txt
-rw-r--r-- root/root      2484 2017-12-07 19:38 ./usr/share/doc/cloud-init/examples/cloud-config-datasources.txt
-rw-r--r-- root/root      2888 2017-12-07 19:38 ./usr/share/doc/cloud-init/examples/cloud-config-disk-setup.txt.gz
-rw-r--r-- root/root       252 2017-12-07 19:38 ./usr/share/doc/cloud-init/examples/cloud-config-final-message.txt
-rw-r--r-- root/root       456 2017-12-07 19:38 ./usr/share/doc/cloud-init/examples/cloud-config-gluster.txt
-rw-r--r-- root/root       980 2017-12-07 19:38 ./usr/share/doc/cloud-init/examples/cloud-config-growpart.txt
-rw-r--r-- root/root       378 2017-12-07 19:38 ./usr/share/doc/cloud-init/examples/cloud-config-install-packages.txt
-rw-r--r-- root/root       779 2017-12-07 19:38 ./usr/share/doc/cloud-init/examples/cloud-config-landscape.txt
-rw-r--r-- root/root       594 2017-12-07 19:38 ./usr/share/doc/cloud-init/examples/cloud-config-launch-index.txt
-rw-r--r-- root/root      1804 2017-12-07 19:38 ./usr/share/doc/cloud-init/examples/cloud-config-lxd.txt
-rw-r--r-- root/root      2501 2017-12-07 19:38 ./usr/share/doc/cloud-init/examples/cloud-config-mcollective.txt
-rw-r--r-- root/root      1495 2017-12-07 19:38 ./usr/share/doc/cloud-init/examples/cloud-config-mount-points.txt
-rw-r--r-- root/root       835 2017-12-07 19:38 ./usr/share/doc/cloud-init/examples/cloud-config-ntp.txt
-rw-r--r-- root/root       364 2017-12-07 19:38 ./usr/share/doc/cloud-init/examples/cloud-config-phone-home.txt
-rw-r--r-- root/root      1619 2017-12-07 19:38 ./usr/share/doc/cloud-init/examples/cloud-config-power-state.txt
-rw-r--r-- root/root      2186 2017-12-07 19:38 ./usr/share/doc/cloud-init/examples/cloud-config-puppet.txt
-rw-r--r-- root/root       405 2017-12-07 19:38 ./usr/share/doc/cloud-init/examples/cloud-config-reporting.txt
-rw-r--r-- root/root       527 2017-12-07 19:38 ./usr/share/doc/cloud-init/examples/cloud-config-resolv-conf.txt
-rw-r--r-- root/root      1463 2017-12-07 19:38 ./usr/share/doc/cloud-init/examples/cloud-config-rh_subscription.txt
-rw-r--r-- root/root      1477 2017-12-07 19:38 ./usr/share/doc/cloud-init/examples/cloud-config-rsyslog.txt
-rw-r--r-- root/root       788 2017-12-07 19:38 ./usr/share/doc/cloud-init/examples/cloud-config-run-cmds.txt
-rw-r--r-- root/root      2405 2017-12-07 19:38 ./usr/share/doc/cloud-init/examples/cloud-config-salt-minion.txt
-rw-r--r-- root/root      1278 2017-12-07 19:38 ./usr/share/doc/cloud-init/examples/cloud-config-seed-random.txt
-rw-r--r-- root/root      3289 2017-12-07 19:38 ./usr/share/doc/cloud-init/examples/cloud-config-ssh-keys.txt
-rw-r--r-- root/root       252 2017-12-07 19:38 ./usr/share/doc/cloud-init/examples/cloud-config-update-apt.txt
-rw-r--r-- root/root       143 2017-12-07 19:38 ./usr/share/doc/cloud-init/examples/cloud-config-update-packages.txt
-rw-r--r-- root/root      2092 2017-12-07 19:38 ./usr/share/doc/cloud-init/examples/cloud-config-user-groups.txt.gz
-rw-r--r-- root/root       561 2017-12-07 19:38 ./usr/share/doc/cloud-init/examples/cloud-config-vendor-data.txt
-rw-r--r-- root/root      1134 2017-12-07 19:38 ./usr/share/doc/cloud-init/examples/cloud-config-write-files.txt
-rw-r--r-- root/root       683 2017-12-07 19:38 ./usr/share/doc/cloud-init/examples/cloud-config-yum-repo.txt
-rw-r--r-- root/root      9328 2017-12-07 19:38 ./usr/share/doc/cloud-init/examples/cloud-config.txt.gz
-rw-r--r-- root/root       353 2017-12-07 19:38 ./usr/share/doc/cloud-init/examples/include-once.txt
-rw-r--r-- root/root       237 2017-12-07 19:38 ./usr/share/doc/cloud-init/examples/include.txt
-rw-r--r-- root/root       839 2017-12-07 19:38 ./usr/share/doc/cloud-init/examples/kernel-cmdline.txt
-rw-r--r-- root/root      1568 2017-12-07 19:38 ./usr/share/doc/cloud-init/examples/part-handler-v2.txt
-rw-r--r-- root/root       834 2017-12-07 19:38 ./usr/share/doc/cloud-init/examples/part-handler.txt
-rw-r--r-- root/root        68 2017-12-07 19:38 ./usr/share/doc/cloud-init/examples/plain-ignored.txt
drwxr-xr-x root/root         0 2017-12-07 20:02 ./usr/share/doc/cloud-init/examples/seed/
-rw-r--r-- root/root       692 2017-12-07 19:38 ./usr/share/doc/cloud-init/examples/seed/README
-rw-r--r-- root/root      1403 2017-12-07 19:38 ./usr/share/doc/cloud-init/examples/seed/meta-data
-rw-r--r-- root/root        91 2017-12-07 19:38 ./usr/share/doc/cloud-init/examples/seed/user-data
-rw-r--r-- root/root       182 2017-12-07 19:38 ./usr/share/doc/cloud-init/examples/upstart-cloud-config.txt
-rw-r--r-- root/root       217 2017-12-07 19:38 ./usr/share/doc/cloud-init/examples/upstart-rclocal.txt
-rw-r--r-- root/root       125 2017-12-07 19:38 ./usr/share/doc/cloud-init/examples/user-script.txt
-rw-r--r-- root/root      1784 2017-12-07 19:38 ./usr/share/doc/cloud-init/status.txt
-rw-r--r-- root/root      3383 2017-12-07 19:38 ./usr/share/doc/cloud-init/userdata.txt
-rw-r--r-- root/root      1888 2017-12-07 19:38 ./usr/share/doc/cloud-init/var-lib-cloud.txt
drwxr-xr-x root/root         0 2017-12-07 20:02 ./usr/share/doc/cloud/
drwxr-xr-x root/root         0 2017-12-07 20:02 ./var/
drwxr-xr-x root/root         0 2017-12-07 20:02 ./var/lib/
drwxr-xr-x root/root         0 2017-12-07 20:02 ./var/lib/cloud/


+------------------------------------------------------------------------------+
| Post Build                                                                   |
+------------------------------------------------------------------------------+


+------------------------------------------------------------------------------+
| Cleanup                                                                      |
+------------------------------------------------------------------------------+

Purging /<<BUILDDIR>>
Not cleaning session: cloned chroot in use

+------------------------------------------------------------------------------+
| Summary                                                                      |
+------------------------------------------------------------------------------+

Build Architecture: amd64
Build-Space: 12332
Build-Time: 16
Distribution: xenial
Host Architecture: amd64
Install-Time: 44
Job: cloud-init_17.1-53-gca2ce2ec-1~bddeb.dsc
Machine Architecture: amd64
Package: cloud-init
Package-Time: 67
Source-Version: 17.1-53-gca2ce2ec-1~bddeb
Space: 12332
Status: successful
Version: 17.1-53-gca2ce2ec-1~bddeb
--------------------------------------------------------------------------------
Finished at 2017-12-07T20:02:47Z
Build needed 00:01:07, 12332k disc space
[Pipeline] }
[Pipeline] // stage
[Pipeline] stage
[Pipeline] { (Ubuntu LTS: Integration)
[Pipeline] sh
[cloud-init-ci] Running shell script
+ python3 -m tests.cloud_tests run --verbose --os-name xenial --test modules/apt_configure_sources_list.yaml --test modules/ntp_servers --test modules/set_password_list --test modules/user_groups --deb cloud-init_17.1-53-gca2ce2ec-1~bddeb_all.deb
2017-12-07 20:02:50,744 - tests.cloud_tests - DEBUG - running with args: Namespace(data_dir=None, deb='cloud-init_17.1-53-gca2ce2ec-1~bddeb_all.deb', feature_override={}, os_name=['xenial'], platform=['lxd'], ppa=None, preserve_data=False, quiet=False, repo=None, result=None, rpm=None, script=None, subcmd='run', test_config=['/var/lib/jenkins/slaves/torkoal/workspace/cloud-init-ci/tests/cloud_tests/testcases/modules/apt_configure_sources_list.yaml', '/var/lib/jenkins/slaves/torkoal/workspace/cloud-init-ci/tests/cloud_tests/testcases/modules/ntp_servers.yaml', '/var/lib/jenkins/slaves/torkoal/workspace/cloud-init-ci/tests/cloud_tests/testcases/modules/set_password_list.yaml', '/var/lib/jenkins/slaves/torkoal/workspace/cloud-init-ci/tests/cloud_tests/testcases/modules/user_groups.yaml'], upgrade=False, upgrade_full=False, verbose=True)
2017-12-07 20:02:50,744 - tests.cloud_tests - DEBUG - using tmpdir: /tmp/cloud_test_data_y6_hd0lv
2017-12-07 20:02:50,751 - tests.cloud_tests - DEBUG - platform config: {'template_overrides': {'/var/lib/cloud/seed/nocloud-net/user-data': {'properties': {'default': '#cloud-config\n{}\n'}, 'template': 'cloud-init-user.tpl', 'when': ['create', 'copy']}, '/var/lib/cloud/seed/nocloud-net/meta-data': {'template': 'cloud-init-meta.tpl', 'when': ['create', 'copy']}, '/var/lib/cloud/seed/nocloud-net/network-config': {'template': 'cloud-init-network.tpl', 'when': ['create', 'copy']}, '/var/lib/cloud/seed/nocloud-net/vendor-data': {'properties': {'default': '#cloud-config\n{}\n'}, 'template': 'cloud-init-vendor.tpl', 'when': ['create', 'copy']}}, 'template_files': {'cloud-init-network.tpl': '{% if config_get("user.network-config", "") == "" %}version: 1\nconfig:\n    - type: physical\n      name: eth0\n      subnets:\n          - type: {% if config_get("user.network_mode", "") == "link-local" %}manual{% else %}dhcp{% endif %}\n            control: auto{% else %}{{ config_get("user.network-config", "") }}{% endif %}\n', 'cloud-init-meta.tpl': '#cloud-config\ninstance-id: {{ container.name }}\nlocal-hostname: {{ container.name }}\n{{ config_get("user.meta-data", "") }}\n', 'cloud-init-vendor.tpl': '{{ config_get("user.vendor-data", properties.default) }}\n', 'cloud-init-user.tpl': '{{ config_get("user.user-data", properties.default) }}\n'}, 'create_instance_timeout': 60, 'enabled': True, 'data_dir': '/tmp/cloud_test_data_y6_hd0lv', 'get_image_timeout': 300}
2017-12-07 20:02:50,751 - tests.cloud_tests - INFO - setting up platform: lxd
2017-12-07 20:02:51,106 - tests.cloud_tests - DEBUG - os config: {'features': {'byobu': True, 'apt_up_out': True, 'syslog': True, 'snap': True, 'rpm': None, 'engb_locale': True, 'ubuntu_repos': True, 'landscape': True, 'ppa': True, 'no_ntpdate': True, 'apt': True, 'ppa_file_name': True, 'sudo': True, 'ubuntu_ntp': True, 'lxd': True, 'ssh_key_fmt': True, 'locale_gen': True, 'apt_src_cont': True, 'no_file_fmt_e': True, 'lsb_release': True, 'daylight_time': True, 'ubuntu_user': True, 'sshd': True, 'hostname': True, 'apt_hist_fmt': True}, 'arch': 'amd64', 'alias': 'xenial', 'system_ready_script': "# permit running or degraded state as both indicate complete boot\n[ $(systemctl is-system-running) = 'running' -o\n  $(systemctl is-system-running) = 'degraded' ]\n", 'setup_overrides': None, 'cloud_init_ready_script': "[ -f '/run/cloud-init/result.json' ]\n", 'override_templates': False, 'release': 'xenial', 'version': 16.04, 'family': 'ubuntu', 'enabled': True, 'boot_clean_script': '#!/bin/bash\nrm -rf /var/log/cloud-init.log /var/log/cloud-init-output.log \\\n    /var/lib/cloud/ /run/cloud-init/ /var/log/syslog\n', 'boot_timeout': 120, 'sstreams_server': 'https://cloud-images.ubuntu.com/daily', 'cache_base_image': True, 'feature_groups': ['base', 'debian_base', 'ubuntu_specific']}
2017-12-07 20:02:51,107 - tests.cloud_tests - INFO - acquiring image for os: xenial
2017-12-07 20:02:52,051 - tests.cloud_tests - DEBUG - updating args for setup with: None
2017-12-07 20:02:52,051 - tests.cloud_tests - INFO - setting up ubuntu-xenial
2017-12-07 20:02:52,079 - tests.cloud_tests - DEBUG - install deb: "cloud-init_17.1-53-gca2ce2ec-1~bddeb_all.deb" into target
2017-12-07 20:02:57,657 - tests.cloud_tests - DEBUG - Executing command: sh -c 'i=0; while [ $i -lt 120 ] && i=$(($i+1)); do [ $(systemctl is-system-running) = '"'"'running'"'"' -o   $(systemctl is-system-running) = '"'"'degraded'"'"' ] && exit 0; sleep 1; done; exit 1'
2017-12-07 20:03:04,937 - tests.cloud_tests - DEBUG - Executing "install deb: "cloud-init_17.1-53-gca2ce2ec-1~bddeb_all.deb" into target"
2017-12-07 20:03:12,987 - tests.cloud_tests - DEBUG - Executing command: dpkg-deb -W '--showformat=${Version}' '/tmp/cloud-init_17.1-53-gca2ce2ec-1~bddeb_all.deb'
2017-12-07 20:03:13,143 - tests.cloud_tests - DEBUG - Executing "query version for package: cloud-init"
2017-12-07 20:03:13,284 - tests.cloud_tests - DEBUG - successfully installed: cloud-init_17.1-53-gca2ce2ec-1~bddeb_all.deb, version: 17.1-53-gca2ce2ec-1~bddeb
2017-12-07 20:03:13,290 - tests.cloud_tests - DEBUG - Executing "query version for package: cloud-init"
2017-12-07 20:03:13,431 - tests.cloud_tests - DEBUG - after setup complete, installed cloud-init version is: 17.1-53-gca2ce2ec-1~bddeb
2017-12-07 20:03:13,431 - tests.cloud_tests - INFO - generating SSH keys
2017-12-07 20:03:13,992 - tests.cloud_tests - DEBUG - creating snapshot for xenial
2017-12-07 20:03:17,037 - tests.cloud_tests - DEBUG - Executing command: sh -c 'i=0; while [ $i -lt 120 ] && i=$(($i+1)); do [ $(systemctl is-system-running) = '"'"'running'"'"' -o   $(systemctl is-system-running) = '"'"'degraded'"'"' ] && [ -f '"'"'/run/cloud-init/result.json'"'"' ] && exit 0; sleep 1; done; exit 1'
2017-12-07 20:03:22,288 - tests.cloud_tests - DEBUG - Executing command: sh -c 'set -e; s="$1"; shift; cat > "$s"; trap "rm -f $s" EXIT; chmod +x "$s"; "$s" "$@"' runscript /tmp/LXDInstance-0000
2017-12-07 20:03:22,508 - tests.cloud_tests - INFO - collecting test data for os: xenial
2017-12-07 20:03:22,512 - tests.cloud_tests - INFO - collecting test data for test: modules/apt_configure_sources_list
2017-12-07 20:03:24,967 - tests.cloud_tests - DEBUG - Executing command: sh -c 'i=0; while [ $i -lt 120 ] && i=$(($i+1)); do [ $(systemctl is-system-running) = '"'"'running'"'"' -o   $(systemctl is-system-running) = '"'"'degraded'"'"' ] && [ -f '"'"'/run/cloud-init/result.json'"'"' ] && exit 0; sleep 1; done; exit 1'
2017-12-07 20:03:31,118 - tests.cloud_tests - DEBUG - running collect script: cloud-init-output.log
2017-12-07 20:03:31,118 - tests.cloud_tests - DEBUG - Executing "collect: cloud-init-output.log"
2017-12-07 20:03:31,281 - tests.cloud_tests - DEBUG - running collect script: instance-id
2017-12-07 20:03:31,281 - tests.cloud_tests - DEBUG - Executing "collect: instance-id"
2017-12-07 20:03:31,442 - tests.cloud_tests - DEBUG - running collect script: cloud-init-version
2017-12-07 20:03:31,442 - tests.cloud_tests - DEBUG - Executing "collect: cloud-init-version"
2017-12-07 20:03:31,601 - tests.cloud_tests - DEBUG - running collect script: result.json
2017-12-07 20:03:31,601 - tests.cloud_tests - DEBUG - Executing "collect: result.json"
2017-12-07 20:03:31,763 - tests.cloud_tests - DEBUG - running collect script: sources.list
2017-12-07 20:03:31,763 - tests.cloud_tests - DEBUG - Executing "collect: sources.list"
2017-12-07 20:03:31,924 - tests.cloud_tests - DEBUG - running collect script: status.json
2017-12-07 20:03:31,924 - tests.cloud_tests - DEBUG - Executing "collect: status.json"
2017-12-07 20:03:32,084 - tests.cloud_tests - DEBUG - running collect script: cloud-init.log
2017-12-07 20:03:32,084 - tests.cloud_tests - DEBUG - Executing "collect: cloud-init.log"
2017-12-07 20:03:32,244 - tests.cloud_tests - DEBUG - getting console log
2017-12-07 20:03:35,301 - tests.cloud_tests - INFO - collecting test data for test: modules/ntp_servers
2017-12-07 20:03:37,700 - tests.cloud_tests - DEBUG - Executing command: sh -c 'i=0; while [ $i -lt 120 ] && i=$(($i+1)); do [ $(systemctl is-system-running) = '"'"'running'"'"' -o   $(systemctl is-system-running) = '"'"'degraded'"'"' ] && [ -f '"'"'/run/cloud-init/result.json'"'"' ] && exit 0; sleep 1; done; exit 1'
2017-12-07 20:04:02,282 - tests.cloud_tests - DEBUG - running collect script: cloud-init-output.log
2017-12-07 20:04:02,282 - tests.cloud_tests - DEBUG - Executing "collect: cloud-init-output.log"
2017-12-07 20:04:02,825 - tests.cloud_tests - DEBUG - running collect script: ntp_installed_servers
2017-12-07 20:04:02,825 - tests.cloud_tests - DEBUG - Executing "collect: ntp_installed_servers"
2017-12-07 20:04:02,994 - tests.cloud_tests - DEBUG - running collect script: instance-id
2017-12-07 20:04:02,995 - tests.cloud_tests - DEBUG - Executing "collect: instance-id"
2017-12-07 20:04:03,176 - tests.cloud_tests - DEBUG - running collect script: cloud-init-version
2017-12-07 20:04:03,176 - tests.cloud_tests - DEBUG - Executing "collect: cloud-init-version"
2017-12-07 20:04:03,336 - tests.cloud_tests - DEBUG - running collect script: ntpq_servers
2017-12-07 20:04:03,336 - tests.cloud_tests - DEBUG - Executing "collect: ntpq_servers"
2017-12-07 20:04:04,001 - tests.cloud_tests - DEBUG - running collect script: result.json
2017-12-07 20:04:04,001 - tests.cloud_tests - DEBUG - Executing "collect: result.json"
2017-12-07 20:04:04,162 - tests.cloud_tests - DEBUG - running collect script: ntp_conf_dist_servers
2017-12-07 20:04:04,163 - tests.cloud_tests - DEBUG - Executing "collect: ntp_conf_dist_servers"
2017-12-07 20:04:04,472 - tests.cloud_tests - DEBUG - running collect script: status.json
2017-12-07 20:04:04,472 - tests.cloud_tests - DEBUG - Executing "collect: status.json"
2017-12-07 20:04:04,636 - tests.cloud_tests - DEBUG - running collect script: ntp_conf_servers
2017-12-07 20:04:04,636 - tests.cloud_tests - DEBUG - Executing "collect: ntp_conf_servers"
2017-12-07 20:04:04,803 - tests.cloud_tests - DEBUG - running collect script: cloud-init.log
2017-12-07 20:04:04,803 - tests.cloud_tests - DEBUG - Executing "collect: cloud-init.log"
2017-12-07 20:04:04,969 - tests.cloud_tests - DEBUG - getting console log
2017-12-07 20:04:09,281 - tests.cloud_tests - INFO - collecting test data for test: modules/set_password_list
2017-12-07 20:04:12,290 - tests.cloud_tests - DEBUG - Executing command: sh -c 'i=0; while [ $i -lt 120 ] && i=$(($i+1)); do [ $(systemctl is-system-running) = '"'"'running'"'"' -o   $(systemctl is-system-running) = '"'"'degraded'"'"' ] && [ -f '"'"'/run/cloud-init/result.json'"'"' ] && exit 0; sleep 1; done; exit 1'
2017-12-07 20:04:20,442 - tests.cloud_tests - DEBUG - running collect script: cloud-init-output.log
2017-12-07 20:04:20,442 - tests.cloud_tests - DEBUG - Executing "collect: cloud-init-output.log"
2017-12-07 20:04:20,613 - tests.cloud_tests - DEBUG - running collect script: instance-id
2017-12-07 20:04:20,613 - tests.cloud_tests - DEBUG - Executing "collect: instance-id"
2017-12-07 20:04:20,777 - tests.cloud_tests - DEBUG - running collect script: shadow
2017-12-07 20:04:20,777 - tests.cloud_tests - DEBUG - Executing "collect: shadow"
2017-12-07 20:04:20,939 - tests.cloud_tests - DEBUG - running collect script: cloud-init-version
2017-12-07 20:04:20,939 - tests.cloud_tests - DEBUG - Executing "collect: cloud-init-version"
2017-12-07 20:04:21,103 - tests.cloud_tests - DEBUG - running collect script: sshd_config
2017-12-07 20:04:21,103 - tests.cloud_tests - DEBUG - Executing "collect: sshd_config"
2017-12-07 20:04:21,291 - tests.cloud_tests - DEBUG - running collect script: result.json
2017-12-07 20:04:21,291 - tests.cloud_tests - DEBUG - Executing "collect: result.json"
2017-12-07 20:04:21,451 - tests.cloud_tests - DEBUG - running collect script: status.json
2017-12-07 20:04:21,451 - tests.cloud_tests - DEBUG - Executing "collect: status.json"
2017-12-07 20:04:21,609 - tests.cloud_tests - DEBUG - running collect script: cloud-init.log
2017-12-07 20:04:21,609 - tests.cloud_tests - DEBUG - Executing "collect: cloud-init.log"
2017-12-07 20:04:21,771 - tests.cloud_tests - DEBUG - getting console log
2017-12-07 20:04:24,454 - tests.cloud_tests - INFO - collecting test data for test: modules/user_groups
2017-12-07 20:04:27,169 - tests.cloud_tests - DEBUG - Executing command: sh -c 'i=0; while [ $i -lt 120 ] && i=$(($i+1)); do [ $(systemctl is-system-running) = '"'"'running'"'"' -o   $(systemctl is-system-running) = '"'"'degraded'"'"' ] && [ -f '"'"'/run/cloud-init/result.json'"'"' ] && exit 0; sleep 1; done; exit 1'
2017-12-07 20:04:33,532 - tests.cloud_tests - DEBUG - running collect script: user_ubuntu
2017-12-07 20:04:33,532 - tests.cloud_tests - DEBUG - Executing "collect: user_ubuntu"
2017-12-07 20:04:33,693 - tests.cloud_tests - DEBUG - running collect script: cloud-init-version
2017-12-07 20:04:33,693 - tests.cloud_tests - DEBUG - Executing "collect: cloud-init-version"
2017-12-07 20:04:33,856 - tests.cloud_tests - DEBUG - running collect script: group_cloud_users
2017-12-07 20:04:33,856 - tests.cloud_tests - DEBUG - Executing "collect: group_cloud_users"
2017-12-07 20:04:34,016 - tests.cloud_tests - DEBUG - running collect script: user_foobar
2017-12-07 20:04:34,017 - tests.cloud_tests - DEBUG - Executing "collect: user_foobar"
2017-12-07 20:04:34,177 - tests.cloud_tests - DEBUG - running collect script: user_barfoo
2017-12-07 20:04:34,177 - tests.cloud_tests - DEBUG - Executing "collect: user_barfoo"
2017-12-07 20:04:34,340 - tests.cloud_tests - DEBUG - running collect script: group_ubuntu
2017-12-07 20:04:34,340 - tests.cloud_tests - DEBUG - Executing "collect: group_ubuntu"
2017-12-07 20:04:34,500 - tests.cloud_tests - DEBUG - running collect script: cloud-init.log
2017-12-07 20:04:34,501 - tests.cloud_tests - DEBUG - Executing "collect: cloud-init.log"
2017-12-07 20:04:34,663 - tests.cloud_tests - DEBUG - running collect script: user_cloudy
2017-12-07 20:04:34,663 - tests.cloud_tests - DEBUG - Executing "collect: user_cloudy"
2017-12-07 20:04:34,823 - tests.cloud_tests - DEBUG - running collect script: cloud-init-output.log
2017-12-07 20:04:34,823 - tests.cloud_tests - DEBUG - Executing "collect: cloud-init-output.log"
2017-12-07 20:04:34,982 - tests.cloud_tests - DEBUG - running collect script: instance-id
2017-12-07 20:04:34,982 - tests.cloud_tests - DEBUG - Executing "collect: instance-id"
2017-12-07 20:04:35,140 - tests.cloud_tests - DEBUG - running collect script: result.json
2017-12-07 20:04:35,140 - tests.cloud_tests - DEBUG - Executing "collect: result.json"
2017-12-07 20:04:35,299 - tests.cloud_tests - DEBUG - running collect script: root_groups
2017-12-07 20:04:35,299 - tests.cloud_tests - DEBUG - Executing "collect: root_groups"
2017-12-07 20:04:35,461 - tests.cloud_tests - DEBUG - running collect script: status.json
2017-12-07 20:04:35,461 - tests.cloud_tests - DEBUG - Executing "collect: status.json"
2017-12-07 20:04:35,642 - tests.cloud_tests - DEBUG - getting console log
2017-12-07 20:04:44,250 - tests.cloud_tests - DEBUG - collect stages: {'time': 113.50607514381409, 'success': True, 'stages': [{'time': 113.17561960220337, 'success': True, 'stages': [{'time': 109.37588238716125, 'success': True, 'stages': [{'time': 21.210938930511475, 'success': True, 'stages': [{'time': 21.210919857025146, 'success': True, 'name': 'setup func for --deb, install deb', 'errors': []}], 'name': 'set up for ubuntu-xenial', 'errors': []}, {'time': 74.83221817016602, 'success': True, 'stages': [{'time': 8.196829080581665, 'success': True, 'stages': [{'time': 7.070524454116821, 'success': True, 'name': 'boot instance', 'errors': []}, {'time': 0.16293954849243164, 'success': True, 'name': 'script cloud-init-output.log', 'errors': []}, {'time': 0.16128063201904297, 'success': True, 'name': 'script instance-id', 'errors': []}, {'time': 0.15918993949890137, 'success': True, 'name': 'script cloud-init-version', 'errors': []}, {'time': 0.161726713180542, 'success': True, 'name': 'script result.json', 'errors': []}, {'time': 0.16083216667175293, 'success': True, 'name': 'script sources.list', 'errors': []}, {'time': 0.15995287895202637, 'success': True, 'name': 'script status.json', 'errors': []}, {'time': 0.16018247604370117, 'success': True, 'name': 'script cloud-init.log', 'errors': []}, {'time': 0.00015211105346679688, 'success': True, 'name': 'collect console', 'errors': []}], 'name': 'collect for test: modules/apt_configure_sources_list', 'errors': []}, {'time': 28.15628981590271, 'success': True, 'stages': [{'time': 25.46869945526123, 'success': True, 'name': 'boot instance', 'errors': []}, {'time': 0.5432620048522949, 'success': True, 'name': 'script cloud-init-output.log', 'errors': []}, {'time': 0.16968250274658203, 'success': True, 'name': 'script ntp_installed_servers', 'errors': []}, {'time': 0.1813352108001709, 'success': True, 'name': 'script instance-id', 'errors': []}, {'time': 0.1603846549987793, 'success': True, 'name': 'script cloud-init-version', 'errors': []}, {'time': 0.6646580696105957, 'success': True, 'name': 'script ntpq_servers', 'errors': []}, {'time': 0.16159963607788086, 'success': True, 'name': 'script result.json', 'errors': []}, {'time': 0.3094351291656494, 'success': True, 'name': 'script ntp_conf_dist_servers', 'errors': []}, {'time': 0.1636676788330078, 'success': True, 'name': 'script status.json', 'errors': []}, {'time': 0.1676163673400879, 'success': True, 'name': 'script ntp_conf_servers', 'errors': []}, {'time': 0.16562724113464355, 'success': True, 'name': 'script cloud-init.log', 'errors': []}, {'time': 0.0002613067626953125, 'success': True, 'name': 'collect console', 'errors': []}], 'name': 'collect for test: modules/ntp_servers', 'errors': []}, {'time': 10.53196907043457, 'success': True, 'stages': [{'time': 9.203297853469849, 'success': True, 'name': 'boot instance', 'errors': []}, {'time': 0.17092251777648926, 'success': True, 'name': 'script cloud-init-output.log', 'errors': []}, {'time': 0.16389751434326172, 'success': True, 'name': 'script instance-id', 'errors': []}, {'time': 0.16223692893981934, 'success': True, 'name': 'script shadow', 'errors': []}, {'time': 0.16388702392578125, 'success': True, 'name': 'script cloud-init-version', 'errors': []}, {'time': 0.18730783462524414, 'success': True, 'name': 'script sshd_config', 'errors': []}, {'time': 0.16007089614868164, 'success': True, 'name': 'script result.json', 'errors': []}, {'time': 0.15832781791687012, 'success': True, 'name': 'script status.json', 'errors': []}, {'time': 0.16167211532592773, 'success': True, 'name': 'script cloud-init.log', 'errors': []}, {'time': 0.0002982616424560547, 'success': True, 'name': 'collect console', 'errors': []}], 'name': 'collect for test: modules/set_password_list', 'errors': []}, {'time': 9.556578159332275, 'success': True, 'stages': [{'time': 7.446580410003662, 'success': True, 'name': 'boot instance', 'errors': []}, {'time': 0.16061091423034668, 'success': True, 'name': 'script user_ubuntu', 'errors': []}, {'time': 0.16307282447814941, 'success': True, 'name': 'script cloud-init-version', 'errors': []}, {'time': 0.1607341766357422, 'success': True, 'name': 'script group_cloud_users', 'errors': []}, {'time': 0.16004228591918945, 'success': True, 'name': 'script user_foobar', 'errors': []}, {'time': 0.16352510452270508, 'success': True, 'name': 'script user_barfoo', 'errors': []}, {'time': 0.16040849685668945, 'success': True, 'name': 'script group_ubuntu', 'errors': []}, {'time': 0.1623837947845459, 'success': True, 'name': 'script cloud-init.log', 'errors': []}, {'time': 0.16051101684570312, 'success': True, 'name': 'script user_cloudy', 'errors': []}, {'time': 0.15838074684143066, 'success': True, 'name': 'script cloud-init-output.log', 'errors': []}, {'time': 0.15796995162963867, 'success': True, 'name': 'script instance-id', 'errors': []}, {'time': 0.159013032913208, 'success': True, 'name': 'script result.json', 'errors': []}, {'time': 0.1622161865234375, 'success': True, 'name': 'script root_groups', 'errors': []}, {'time': 0.18088793754577637, 'success': True, 'name': 'script status.json', 'errors': []}, {'time': 0.00016736984252929688, 'success': True, 'name': 'collect console', 'errors': []}], 'name': 'collect for test: modules/user_groups', 'errors': []}], 'name': 'collect test data for xenial', 'errors': []}], 'name': 'set up and collect data for os: xenial', 'errors': []}], 'name': 'collect for platform: lxd', 'errors': []}], 'name': 'collect data', 'errors': []}
2017-12-07 20:04:44,251 - tests.cloud_tests - DEBUG - found test data: {'lxd': {'xenial': ['modules/set_password_list', 'modules/user_groups', 'modules/ntp_servers', 'modules/apt_configure_sources_list']}}

2017-12-07 20:04:44,251 - tests.cloud_tests - INFO - test: platform='lxd', os='xenial' verifying test data
2017-12-07 20:04:44,251 - tests.cloud_tests - DEBUG - verifying test data for modules/set_password_list
test_no_stages_errors (tests.cloud_tests.testcases.modules.set_password_list.TestPasswordList)
Ensure that there were no errors in any stage. ... ok
test_no_warnings_in_log (tests.cloud_tests.testcases.modules.set_password_list.TestPasswordList)
Warnings should not be found in the log. ... ok
test_shadow_expected_users (tests.cloud_tests.testcases.modules.set_password_list.TestPasswordList)
Test every tom, dick, and harry user in shadow. ... ok
test_shadow_passwords (tests.cloud_tests.testcases.modules.set_password_list.TestPasswordList)
Test shadow passwords. ... ok
test_sshd_config (tests.cloud_tests.testcases.modules.set_password_list.TestPasswordList)
Test sshd config allows passwords. ... ok

----------------------------------------------------------------------
Ran 5 tests in 0.004s

OK
2017-12-07 20:04:44,262 - tests.cloud_tests - DEBUG - verifying test data for modules/user_groups
test_group_cloud_users (tests.cloud_tests.testcases.modules.user_groups.TestUserGroups)
Test cloud users group exists. ... ok
test_group_ubuntu (tests.cloud_tests.testcases.modules.user_groups.TestUserGroups)
Test ubuntu group exists. ... ok
test_no_stages_errors (tests.cloud_tests.testcases.modules.user_groups.TestUserGroups)
Ensure that there were no errors in any stage. ... ok
test_no_warnings_in_log (tests.cloud_tests.testcases.modules.user_groups.TestUserGroups)
Warnings should not be found in the log. ... ok
test_user_barfoo (tests.cloud_tests.testcases.modules.user_groups.TestUserGroups)
Test barfoo user exists. ... ok
test_user_cloudy (tests.cloud_tests.testcases.modules.user_groups.TestUserGroups)
Test cloudy user exists. ... ok
test_user_foobar (tests.cloud_tests.testcases.modules.user_groups.TestUserGroups)
Test foobar user exists. ... ok
test_user_root_in_secret (tests.cloud_tests.testcases.modules.user_groups.TestUserGroups)
Test root user is in 'secret' group. ... ok
test_user_ubuntu (tests.cloud_tests.testcases.modules.user_groups.TestUserGroups)
Test ubuntu user exists. ... ok

----------------------------------------------------------------------
Ran 9 tests in 0.001s

OK
2017-12-07 20:04:44,270 - tests.cloud_tests - DEBUG - verifying test data for modules/ntp_servers
test_no_stages_errors (tests.cloud_tests.testcases.modules.ntp_servers.TestNtpServers)
Ensure that there were no errors in any stage. ... ok
test_no_warnings_in_log (tests.cloud_tests.testcases.modules.ntp_servers.TestNtpServers)
Warnings should not be found in the log. ... ok
test_ntp_dist_entries (tests.cloud_tests.testcases.modules.ntp_servers.TestNtpServers)
Test dist config file is empty ... ok
test_ntp_entries (tests.cloud_tests.testcases.modules.ntp_servers.TestNtpServers)
Test config server entries ... ok
test_ntp_installed (tests.cloud_tests.testcases.modules.ntp_servers.TestNtpServers)
Test ntp installed ... ok
test_ntpq_servers (tests.cloud_tests.testcases.modules.ntp_servers.TestNtpServers)
Test ntpq output has configured servers ... ok

----------------------------------------------------------------------
Ran 6 tests in 0.002s

OK
2017-12-07 20:04:44,277 - tests.cloud_tests - DEBUG - verifying test data for modules/apt_configure_sources_list
test_no_stages_errors (tests.cloud_tests.testcases.modules.apt_configure_sources_list.TestAptconfigureSourcesList)
Ensure that there were no errors in any stage. ... ok
test_no_warnings_in_log (tests.cloud_tests.testcases.modules.apt_configure_sources_list.TestAptconfigureSourcesList)
Warnings should not be found in the log. ... ok
test_sources_list (tests.cloud_tests.testcases.modules.apt_configure_sources_list.TestAptconfigureSourcesList)
Test sources.list includes sources. ... ok

----------------------------------------------------------------------
Ran 3 tests in 0.002s

OK
2017-12-07 20:04:44,304 - tests.cloud_tests - INFO - test: platform='lxd', os='xenial' passed all tests
2017-12-07 20:04:44,304 - tests.cloud_tests - DEBUG - verify results: {'lxd': {'xenial': {'modules/user_groups': {'passed': True, 'failures': []}, 'modules/apt_configure_sources_list': {'passed': True, 'failures': []}, 'modules/set_password_list': {'passed': True, 'failures': []}, 'modules/ntp_servers': {'passed': True, 'failures': []}}}}
[Pipeline] }
[Pipeline] // stage
[Pipeline] stage
[Pipeline] { (MAAS Compatability Testing)
[Pipeline] sh
[cloud-init-ci] Running shell script
+ http_proxy=http://squid.internal:3128 ./tools/run-centos -r -u 6
Creating cloud-init-centos-df92da3c


Starting cloud-init-centos-df92da3c
Installing prep packages: tar git python-argparse
:: running yum install --downloadonly --assumeyes --setopt=keepcache=1 tar git python-argparse [1/10]
Failed to set locale, defaulting to C
Setting up Install Process
Resolving Dependencies
--> Running transaction check
---> Package git.x86_64 0:1.7.1-9.el6_9 will be installed
--> Processing Dependency: perl-Git = 1.7.1-9.el6_9 for package: git-1.7.1-9.el6_9.x86_64
--> Processing Dependency: perl >= 5.006 for package: git-1.7.1-9.el6_9.x86_64
--> Processing Dependency: rsync for package: git-1.7.1-9.el6_9.x86_64
--> Processing Dependency: perl(warnings) for package: git-1.7.1-9.el6_9.x86_64
--> Processing Dependency: perl(vars) for package: git-1.7.1-9.el6_9.x86_64
--> Processing Dependency: perl(strict) for package: git-1.7.1-9.el6_9.x86_64
--> Processing Dependency: perl(lib) for package: git-1.7.1-9.el6_9.x86_64
--> Processing Dependency: perl(Git) for package: git-1.7.1-9.el6_9.x86_64
--> Processing Dependency: perl(Getopt::Long) for package: git-1.7.1-9.el6_9.x86_64
--> Processing Dependency: perl(File::Spec) for package: git-1.7.1-9.el6_9.x86_64
--> Processing Dependency: perl(File::Find) for package: git-1.7.1-9.el6_9.x86_64
--> Processing Dependency: perl(File::Basename) for package: git-1.7.1-9.el6_9.x86_64
--> Processing Dependency: perl(Exporter) for package: git-1.7.1-9.el6_9.x86_64
--> Processing Dependency: perl(Error) for package: git-1.7.1-9.el6_9.x86_64
--> Processing Dependency: perl(Cwd) for package: git-1.7.1-9.el6_9.x86_64
--> Processing Dependency: /usr/bin/perl for package: git-1.7.1-9.el6_9.x86_64
---> Package python-argparse.noarch 0:1.2.1-2.1.el6 will be installed
---> Package tar.x86_64 2:1.23-15.el6_8 will be installed
--> Running transaction check
---> Package perl.x86_64 4:5.10.1-144.el6 will be installed
--> Processing Dependency: perl-libs = 4:5.10.1-144.el6 for package: 4:perl-5.10.1-144.el6.x86_64
--> Processing Dependency: perl-libs for package: 4:perl-5.10.1-144.el6.x86_64
--> Processing Dependency: perl(version) for package: 4:perl-5.10.1-144.el6.x86_64
--> Processing Dependency: perl(Pod::Simple) for package: 4:perl-5.10.1-144.el6.x86_64
--> Processing Dependency: perl(Module::Pluggable) for package: 4:perl-5.10.1-144.el6.x86_64
--> Processing Dependency: libperl.so()(64bit) for package: 4:perl-5.10.1-144.el6.x86_64
---> Package perl-Error.noarch 1:0.17015-4.el6 will be installed
---> Package perl-Git.noarch 0:1.7.1-9.el6_9 will be installed
---> Package rsync.x86_64 0:3.0.6-12.el6 will be installed
--> Running transaction check
---> Package perl-Module-Pluggable.x86_64 1:3.90-144.el6 will be installed
---> Package perl-Pod-Simple.x86_64 1:3.13-144.el6 will be installed
--> Processing Dependency: perl(Pod::Escapes) >= 1.04 for package: 1:perl-Pod-Simple-3.13-144.el6.x86_64
---> Package perl-libs.x86_64 4:5.10.1-144.el6 will be installed
---> Package perl-version.x86_64 3:0.77-144.el6 will be installed
--> Running transaction check
---> Package perl-Pod-Escapes.x86_64 1:1.04-144.el6 will be installed
--> Finished Dependency Resolution

Dependencies Resolved

================================================================================
 Package                   Arch       Version                 Repository   Size
================================================================================
Installing:
 git                       x86_64     1.7.1-9.el6_9           updates     4.6 M
 python-argparse           noarch     1.2.1-2.1.el6           base         48 k
 tar                       x86_64     2:1.23-15.el6_8         base        810 k
Installing for dependencies:
 perl                      x86_64     4:5.10.1-144.el6        base         10 M
 perl-Error                noarch     1:0.17015-4.el6         base         29 k
 perl-Git                  noarch     1.7.1-9.el6_9           updates      29 k
 perl-Module-Pluggable     x86_64     1:3.90-144.el6          base         41 k
 perl-Pod-Escapes          x86_64     1:1.04-144.el6          base         33 k
 perl-Pod-Simple           x86_64     1:3.13-144.el6          base        213 k
 perl-libs                 x86_64     4:5.10.1-144.el6        base        579 k
 perl-version              x86_64     3:0.77-144.el6          base         52 k
 rsync                     x86_64     3.0.6-12.el6            base        335 k

Transaction Summary
================================================================================
Install      12 Package(s)

Total download size: 17 M
Installed size: 54 M
Downloading Packages:
--------------------------------------------------------------------------------
Total                                           2.1 MB/s |  17 MB     00:08     
exiting because --downloadonly specified
:: running yum install --cacheonly --assumeyes tar git python-argparse
Failed to set locale, defaulting to C
Setting up Install Process
Resolving Dependencies
--> Running transaction check
---> Package git.x86_64 0:1.7.1-9.el6_9 will be installed
--> Processing Dependency: perl-Git = 1.7.1-9.el6_9 for package: git-1.7.1-9.el6_9.x86_64
--> Processing Dependency: perl >= 5.006 for package: git-1.7.1-9.el6_9.x86_64
--> Processing Dependency: rsync for package: git-1.7.1-9.el6_9.x86_64
--> Processing Dependency: perl(warnings) for package: git-1.7.1-9.el6_9.x86_64
--> Processing Dependency: perl(vars) for package: git-1.7.1-9.el6_9.x86_64
--> Processing Dependency: perl(strict) for package: git-1.7.1-9.el6_9.x86_64
--> Processing Dependency: perl(lib) for package: git-1.7.1-9.el6_9.x86_64
--> Processing Dependency: perl(Git) for package: git-1.7.1-9.el6_9.x86_64
--> Processing Dependency: perl(Getopt::Long) for package: git-1.7.1-9.el6_9.x86_64
--> Processing Dependency: perl(File::Spec) for package: git-1.7.1-9.el6_9.x86_64
--> Processing Dependency: perl(File::Find) for package: git-1.7.1-9.el6_9.x86_64
--> Processing Dependency: perl(File::Basename) for package: git-1.7.1-9.el6_9.x86_64
--> Processing Dependency: perl(Exporter) for package: git-1.7.1-9.el6_9.x86_64
--> Processing Dependency: perl(Error) for package: git-1.7.1-9.el6_9.x86_64
--> Processing Dependency: perl(Cwd) for package: git-1.7.1-9.el6_9.x86_64
--> Processing Dependency: /usr/bin/perl for package: git-1.7.1-9.el6_9.x86_64
---> Package python-argparse.noarch 0:1.2.1-2.1.el6 will be installed
---> Package tar.x86_64 2:1.23-15.el6_8 will be installed
--> Running transaction check
---> Package perl.x86_64 4:5.10.1-144.el6 will be installed
--> Processing Dependency: perl-libs = 4:5.10.1-144.el6 for package: 4:perl-5.10.1-144.el6.x86_64
--> Processing Dependency: perl-libs for package: 4:perl-5.10.1-144.el6.x86_64
--> Processing Dependency: perl(version) for package: 4:perl-5.10.1-144.el6.x86_64
--> Processing Dependency: perl(Pod::Simple) for package: 4:perl-5.10.1-144.el6.x86_64
--> Processing Dependency: perl(Module::Pluggable) for package: 4:perl-5.10.1-144.el6.x86_64
--> Processing Dependency: libperl.so()(64bit) for package: 4:perl-5.10.1-144.el6.x86_64
---> Package perl-Error.noarch 1:0.17015-4.el6 will be installed
---> Package perl-Git.noarch 0:1.7.1-9.el6_9 will be installed
---> Package rsync.x86_64 0:3.0.6-12.el6 will be installed
--> Running transaction check
---> Package perl-Module-Pluggable.x86_64 1:3.90-144.el6 will be installed
---> Package perl-Pod-Simple.x86_64 1:3.13-144.el6 will be installed
--> Processing Dependency: perl(Pod::Escapes) >= 1.04 for package: 1:perl-Pod-Simple-3.13-144.el6.x86_64
---> Package perl-libs.x86_64 4:5.10.1-144.el6 will be installed
---> Package perl-version.x86_64 3:0.77-144.el6 will be installed
--> Running transaction check
---> Package perl-Pod-Escapes.x86_64 1:1.04-144.el6 will be installed
--> Finished Dependency Resolution

Dependencies Resolved

================================================================================
 Package                   Arch       Version                 Repository   Size
================================================================================
Installing:
 git                       x86_64     1.7.1-9.el6_9           updates     4.6 M
 python-argparse           noarch     1.2.1-2.1.el6           base         48 k
 tar                       x86_64     2:1.23-15.el6_8         base        810 k
Installing for dependencies:
 perl                      x86_64     4:5.10.1-144.el6        base         10 M
 perl-Error                noarch     1:0.17015-4.el6         base         29 k
 perl-Git                  noarch     1.7.1-9.el6_9           updates      29 k
 perl-Module-Pluggable     x86_64     1:3.90-144.el6          base         41 k
 perl-Pod-Escapes          x86_64     1:1.04-144.el6          base         33 k
 perl-Pod-Simple           x86_64     1:3.13-144.el6          base        213 k
 perl-libs                 x86_64     4:5.10.1-144.el6        base        579 k
 perl-version              x86_64     3:0.77-144.el6          base         52 k
 rsync                     x86_64     3.0.6-12.el6            base        335 k

Transaction Summary
================================================================================
Install      12 Package(s)

Total size: 17 M
Installed size: 54 M
Downloading Packages:
Retrieving key from file:///etc/pki/rpm-gpg/RPM-GPG-KEY-CentOS-6
warning: rpmts_HdrFromFdno: Header V3 RSA/SHA256 Signature, key ID c105b9de: NOKEY
Importing GPG key 0xC105B9DE:
 Userid : CentOS-6 Key (CentOS 6 Official Signing Key) <centos-6-key@centos.org>
 Package: centos-release-6-9.el6.12.3.x86_64 (@base)
 From   : /etc/pki/rpm-gpg/RPM-GPG-KEY-CentOS-6
Running rpm_check_debug
Running Transaction Test
Transaction Test Succeeded
Running Transaction

  Installing : 1:perl-Pod-Escapes-1.04-144.el6.x86_64                      1/12 

  Installing : 3:perl-version-0.77-144.el6.x86_64                          2/12 

  Installing : 1:perl-Module-Pluggable-3.90-144.el6.x86_64                 3/12 

  Installing : 1:perl-Pod-Simple-3.13-144.el6.x86_64                       4/12 

  Installing : 4:perl-libs-5.10.1-144.el6.x86_64                           5/12 

  Installing : 4:perl-5.10.1-144.el6.x86_64                                6/12 

  Installing : 1:perl-Error-0.17015-4.el6.noarch                           7/12 

  Installing : rsync-3.0.6-12.el6.x86_64                                   8/12 

  Installing : perl-Git-1.7.1-9.el6_9.noarch                               9/12 

  Installing : git-1.7.1-9.el6_9.x86_64                                   10/12 

  Installing : python-argparse-1.2.1-2.1.el6.noarch                       11/12 

  Installing : 2:tar-1.23-15.el6_8.x86_64                                 12/12 

  Verifying  : 1:perl-Error-0.17015-4.el6.noarch                           1/12 

  Verifying  : 2:tar-1.23-15.el6_8.x86_64                                  2/12 

  Verifying  : 4:perl-libs-5.10.1-144.el6.x86_64                           3/12 

  Verifying  : perl-Git-1.7.1-9.el6_9.noarch                               4/12 

  Verifying  : 4:perl-5.10.1-144.el6.x86_64                                5/12 

  Verifying  : 3:perl-version-0.77-144.el6.x86_64                          6/12 

  Verifying  : rsync-3.0.6-12.el6.x86_64                                   7/12 

  Verifying  : 1:perl-Pod-Simple-3.13-144.el6.x86_64                       8/12 

  Verifying  : 1:perl-Module-Pluggable-3.90-144.el6.x86_64                 9/12 

  Verifying  : git-1.7.1-9.el6_9.x86_64                                   10/12 

  Verifying  : 1:perl-Pod-Escapes-1.04-144.el6.x86_64                     11/12 

  Verifying  : python-argparse-1.2.1-2.1.el6.noarch                       12/12 

Installed:
  git.x86_64 0:1.7.1-9.el6_9       python-argparse.noarch 0:1.2.1-2.1.el6      
  tar.x86_64 2:1.23-15.el6_8      

Dependency Installed:
  perl.x86_64 4:5.10.1-144.el6                                                  
  perl-Error.noarch 1:0.17015-4.el6                                             
  perl-Git.noarch 0:1.7.1-9.el6_9                                               
  perl-Module-Pluggable.x86_64 1:3.90-144.el6                                   
  perl-Pod-Escapes.x86_64 1:1.04-144.el6                                        
  perl-Pod-Simple.x86_64 1:3.13-144.el6                                         
  perl-libs.x86_64 4:5.10.1-144.el6                                             
  perl-version.x86_64 3:0.77-144.el6                                            
  rsync.x86_64 0:3.0.6-12.el6                                                   

Complete!
:: running yum install --downloadonly --assumeyes --setopt=keepcache=1 epel-release [1/10]
Failed to set locale, defaulting to C
Setting up Install Process
Resolving Dependencies
--> Running transaction check
---> Package epel-release.noarch 0:6-8 will be installed
--> Finished Dependency Resolution

Dependencies Resolved

================================================================================
 Package                Arch             Version         Repository        Size
================================================================================
Installing:
 epel-release           noarch           6-8             extras            14 k

Transaction Summary
================================================================================
Install       1 Package(s)

Total download size: 14 k
Installed size: 22 k
Downloading Packages:
exiting because --downloadonly specified
:: running yum install --cacheonly --assumeyes epel-release
Failed to set locale, defaulting to C
Setting up Install Process
Resolving Dependencies
--> Running transaction check
---> Package epel-release.noarch 0:6-8 will be installed
--> Finished Dependency Resolution

Dependencies Resolved

================================================================================
 Package                Arch             Version         Repository        Size
================================================================================
Installing:
 epel-release           noarch           6-8             extras            14 k

Transaction Summary
================================================================================
Install       1 Package(s)

Total size: 14 k
Installed size: 22 k
Downloading Packages:
Running rpm_check_debug
Running Transaction Test
Transaction Test Succeeded
Running Transaction

  Installing : epel-release-6-8.noarch                                      1/1 

  Verifying  : epel-release-6-8.noarch                                      1/1 

Installed:
  epel-release.noarch 0:6-8                                                     

Complete!
:: running yum install --downloadonly --assumeyes --setopt=keepcache=1 python-configobj python-oauthlib python-contextlib2 python-coverage python-httpretty python-six PyYAML python-jsonpatch python-jinja2 python-jsonschema python-setuptools python-requests python-unittest2 python-mock python-nose e2fsprogs iproute net-tools procps rsyslog shadow-utils sudo python-devel python-setuptools make sudo tar python-tox rpm-build [1/10]
Failed to set locale, defaulting to C
Setting up Install Process
Package iproute-2.6.32-54.el6.x86_64 already installed and latest version
Package net-tools-1.60-114.el6.x86_64 already installed and latest version
Package procps-3.2.8-45.el6_9.1.x86_64 already installed and latest version
Package rsyslog-5.8.10-10.el6_6.x86_64 already installed and latest version
Package 2:shadow-utils-4.1.5.1-5.el6.x86_64 already installed and latest version
Package 1:make-3.81-23.el6.x86_64 already installed and latest version
Package 2:tar-1.23-15.el6_8.x86_64 already installed and latest version
Resolving Dependencies
--> Running transaction check
---> Package PyYAML.x86_64 0:3.10-3.1.el6 will be installed
--> Processing Dependency: libyaml-0.so.2()(64bit) for package: PyYAML-3.10-3.1.el6.x86_64
---> Package e2fsprogs.x86_64 0:1.41.12-23.el6 will be installed
--> Processing Dependency: libss = 1.41.12-23.el6 for package: e2fsprogs-1.41.12-23.el6.x86_64
--> Processing Dependency: e2fsprogs-libs = 1.41.12-23.el6 for package: e2fsprogs-1.41.12-23.el6.x86_64
--> Processing Dependency: libss.so.2()(64bit) for package: e2fsprogs-1.41.12-23.el6.x86_64
--> Processing Dependency: libext2fs.so.2()(64bit) for package: e2fsprogs-1.41.12-23.el6.x86_64
--> Processing Dependency: libe2p.so.2()(64bit) for package: e2fsprogs-1.41.12-23.el6.x86_64
---> Package python-configobj.noarch 0:4.6.0-3.el6 will be installed
---> Package python-contextlib2.noarch 0:0.5.1-1.el6 will be installed
---> Package python-coverage.x86_64 0:3.0.1-2.el6 will be installed
---> Package python-devel.x86_64 0:2.6.6-66.el6_8 will be installed
---> Package python-httpretty.noarch 0:0.8.14-2.20161011git70af1f8.el6 will be installed
--> Processing Dependency: python-urllib3 for package: python-httpretty-0.8.14-2.20161011git70af1f8.el6.noarch
---> Package python-jinja2.x86_64 0:2.2.1-3.el6 will be installed
--> Processing Dependency: python-babel >= 0.8 for package: python-jinja2-2.2.1-3.el6.x86_64
---> Package python-jsonpatch.noarch 0:1.2-4.el6 will be installed
--> Processing Dependency: python-jsonpointer for package: python-jsonpatch-1.2-4.el6.noarch
---> Package python-jsonschema.noarch 0:2.3.0-1.el6 will be installed
---> Package python-nose.noarch 0:0.10.4-3.1.el6 will be installed
---> Package python-oauthlib.noarch 0:0.6.0-4.el6 will be installed
--> Processing Dependency: python-crypto2.6 for package: python-oauthlib-0.6.0-4.el6.noarch
---> Package python-requests.noarch 0:2.6.0-4.el6 will be installed
--> Processing Dependency: python-chardet >= 2.2.1-1 for package: python-requests-2.6.0-4.el6.noarch
---> Package python-setuptools.noarch 0:0.6.10-3.el6 will be installed
---> Package python-six.noarch 0:1.9.0-2.el6 will be installed
---> Package python-tox.noarch 0:1.4.2-8.el6 will be installed
--> Processing Dependency: python-py for package: python-tox-1.4.2-8.el6.noarch
--> Processing Dependency: python-virtualenv for package: python-tox-1.4.2-8.el6.noarch
---> Package python-unittest2.noarch 0:0.5.1-3.el6 will be installed
---> Package python2-mock.noarch 0:1.0.1-10.el6 will be installed
---> Package rpm-build.x86_64 0:4.8.0-55.el6 will be installed
--> Processing Dependency: patch >= 2.5 for package: rpm-build-4.8.0-55.el6.x86_64
--> Processing Dependency: elfutils >= 0.128 for package: rpm-build-4.8.0-55.el6.x86_64
--> Processing Dependency: xz for package: rpm-build-4.8.0-55.el6.x86_64
--> Processing Dependency: unzip for package: rpm-build-4.8.0-55.el6.x86_64
--> Processing Dependency: system-rpm-config for package: rpm-build-4.8.0-55.el6.x86_64
--> Processing Dependency: lzma for package: rpm-build-4.8.0-55.el6.x86_64
--> Processing Dependency: file for package: rpm-build-4.8.0-55.el6.x86_64
--> Processing Dependency: bzip2 for package: rpm-build-4.8.0-55.el6.x86_64
--> Processing Dependency: /usr/bin/gdb-add-index for package: rpm-build-4.8.0-55.el6.x86_64
---> Package sudo.x86_64 0:1.8.6p3-29.el6_9 will be installed
--> Running transaction check
---> Package bzip2.x86_64 0:1.0.5-7.el6_0 will be installed
---> Package e2fsprogs-libs.x86_64 0:1.41.12-23.el6 will be installed
---> Package elfutils.x86_64 0:0.164-2.el6 will be installed
--> Processing Dependency: elfutils-libs(x86-64) = 0.164-2.el6 for package: elfutils-0.164-2.el6.x86_64
--> Processing Dependency: libdw.so.1(ELFUTILS_0.158)(64bit) for package: elfutils-0.164-2.el6.x86_64
--> Processing Dependency: libdw.so.1(ELFUTILS_0.149)(64bit) for package: elfutils-0.164-2.el6.x86_64
--> Processing Dependency: libdw.so.1(ELFUTILS_0.148)(64bit) for package: elfutils-0.164-2.el6.x86_64
--> Processing Dependency: libdw.so.1(ELFUTILS_0.138)(64bit) for package: elfutils-0.164-2.el6.x86_64
--> Processing Dependency: libdw.so.1(ELFUTILS_0.130)(64bit) for package: elfutils-0.164-2.el6.x86_64
--> Processing Dependency: libdw.so.1(ELFUTILS_0.127)(64bit) for package: elfutils-0.164-2.el6.x86_64
--> Processing Dependency: libdw.so.1(ELFUTILS_0.126)(64bit) for package: elfutils-0.164-2.el6.x86_64
--> Processing Dependency: libdw.so.1(ELFUTILS_0.122)(64bit) for package: elfutils-0.164-2.el6.x86_64
--> Processing Dependency: libasm.so.1(ELFUTILS_1.0)(64bit) for package: elfutils-0.164-2.el6.x86_64
--> Processing Dependency: libdw.so.1()(64bit) for package: elfutils-0.164-2.el6.x86_64
--> Processing Dependency: libasm.so.1()(64bit) for package: elfutils-0.164-2.el6.x86_64
---> Package file.x86_64 0:5.04-30.el6 will be installed
---> Package gdb.x86_64 0:7.2-92.el6 will be installed
---> Package libss.x86_64 0:1.41.12-23.el6 will be installed
---> Package libyaml.x86_64 0:0.1.3-4.el6_6 will be installed
---> Package patch.x86_64 0:2.6-6.el6 will be installed
---> Package python-babel.noarch 0:0.9.4-5.1.el6 will be installed
---> Package python-chardet.noarch 0:2.2.1-1.el6 will be installed
---> Package python-crypto2.6.x86_64 0:2.6.1-2.el6 will be installed
---> Package python-jsonpointer.noarch 0:1.0-4.el6 will be installed
---> Package python-py.noarch 0:1.4.18-1.el6.centos will be installed
---> Package python-urllib3.noarch 0:1.10.2-3.el6 will be installed
--> Processing Dependency: python-backports-ssl_match_hostname for package: python-urllib3-1.10.2-3.el6.noarch
---> Package python-virtualenv.noarch 0:1.10.1-1.el6 will be installed
---> Package redhat-rpm-config.noarch 0:9.0.3-51.el6.centos will be installed
---> Package unzip.x86_64 0:6.0-5.el6 will be installed
---> Package xz.x86_64 0:4.999.9-0.5.beta.20091007git.el6 will be installed
---> Package xz-lzma-compat.x86_64 0:4.999.9-0.5.beta.20091007git.el6 will be installed
--> Running transaction check
---> Package elfutils-libs.x86_64 0:0.164-2.el6 will be installed
---> Package python-backports-ssl_match_hostname.noarch 0:3.4.0.2-5.el6 will be installed
--> Processing Dependency: python-backports for package: python-backports-ssl_match_hostname-3.4.0.2-5.el6.noarch
--> Running transaction check
---> Package python-backports.x86_64 0:1.0-5.el6 will be installed
--> Finished Dependency Resolution

Dependencies Resolved

================================================================================
 Package                  Arch   Version                          Repository
                                                                           Size
================================================================================
Installing:
 PyYAML                   x86_64 3.10-3.1.el6                     base    157 k
 e2fsprogs                x86_64 1.41.12-23.el6                   base    554 k
 python-configobj         noarch 4.6.0-3.el6                      base    182 k
 python-contextlib2       noarch 0.5.1-1.el6                      epel     17 k
 python-coverage          x86_64 3.0.1-2.el6                      base     71 k
 python-devel             x86_64 2.6.6-66.el6_8                   base    173 k
 python-httpretty         noarch 0.8.14-2.20161011git70af1f8.el6  epel     44 k
 python-jinja2            x86_64 2.2.1-3.el6                      base    466 k
 python-jsonpatch         noarch 1.2-4.el6                        base     15 k
 python-jsonschema        noarch 2.3.0-1.el6                      epel     62 k
 python-nose              noarch 0.10.4-3.1.el6                   base    220 k
 python-oauthlib          noarch 0.6.0-4.el6                      epel    119 k
 python-requests          noarch 2.6.0-4.el6                      base     96 k
 python-setuptools        noarch 0.6.10-3.el6                     base    336 k
 python-six               noarch 1.9.0-2.el6                      base     28 k
 python-tox               noarch 1.4.2-8.el6                      epel     72 k
 python-unittest2         noarch 0.5.1-3.el6                      epel    138 k
 python2-mock             noarch 1.0.1-10.el6                     epel     93 k
 rpm-build                x86_64 4.8.0-55.el6                     base    131 k
 sudo                     x86_64 1.8.6p3-29.el6_9                 updates 711 k
Installing for dependencies:
 bzip2                    x86_64 1.0.5-7.el6_0                    base     49 k
 e2fsprogs-libs           x86_64 1.41.12-23.el6                   base    121 k
 elfutils                 x86_64 0.164-2.el6                      base    240 k
 elfutils-libs            x86_64 0.164-2.el6                      base    230 k
 file                     x86_64 5.04-30.el6                      base     49 k
 gdb                      x86_64 7.2-92.el6                       base    2.3 M
 libss                    x86_64 1.41.12-23.el6                   base     42 k
 libyaml                  x86_64 0.1.3-4.el6_6                    base     52 k
 patch                    x86_64 2.6-6.el6                        base     90 k
 python-babel             noarch 0.9.4-5.1.el6                    base    1.4 M
 python-backports         x86_64 1.0-5.el6                        base    5.5 k
 python-backports-ssl_match_hostname
                          noarch 3.4.0.2-5.el6                    base     12 k
 python-chardet           noarch 2.2.1-1.el6                      base    230 k
 python-crypto2.6         x86_64 2.6.1-2.el6                      epel    513 k
 python-jsonpointer       noarch 1.0-4.el6                        base    9.4 k
 python-py                noarch 1.4.18-1.el6.centos              extras  308 k
 python-urllib3           noarch 1.10.2-3.el6                     base    103 k
 python-virtualenv        noarch 1.10.1-1.el6                     epel    1.3 M
 redhat-rpm-config        noarch 9.0.3-51.el6.centos              base     60 k
 unzip                    x86_64 6.0-5.el6                        base    152 k
 xz                       x86_64 4.999.9-0.5.beta.20091007git.el6 base    137 k
 xz-lzma-compat           x86_64 4.999.9-0.5.beta.20091007git.el6 base     16 k

Transaction Summary
================================================================================
Install      42 Package(s)

Total download size: 11 M
Installed size: 34 M
Downloading Packages:
--------------------------------------------------------------------------------
Total                                           2.0 MB/s |  11 MB     00:05     
exiting because --downloadonly specified
:: running yum install --cacheonly --assumeyes python-configobj python-oauthlib python-contextlib2 python-coverage python-httpretty python-six PyYAML python-jsonpatch python-jinja2 python-jsonschema python-setuptools python-requests python-unittest2 python-mock python-nose e2fsprogs iproute net-tools procps rsyslog shadow-utils sudo python-devel python-setuptools make sudo tar python-tox rpm-build
Failed to set locale, defaulting to C
Setting up Install Process
Package iproute-2.6.32-54.el6.x86_64 already installed and latest version
Package net-tools-1.60-114.el6.x86_64 already installed and latest version
Package procps-3.2.8-45.el6_9.1.x86_64 already installed and latest version
Package rsyslog-5.8.10-10.el6_6.x86_64 already installed and latest version
Package 2:shadow-utils-4.1.5.1-5.el6.x86_64 already installed and latest version
Package 1:make-3.81-23.el6.x86_64 already installed and latest version
Package 2:tar-1.23-15.el6_8.x86_64 already installed and latest version
Resolving Dependencies
--> Running transaction check
---> Package PyYAML.x86_64 0:3.10-3.1.el6 will be installed
--> Processing Dependency: libyaml-0.so.2()(64bit) for package: PyYAML-3.10-3.1.el6.x86_64
---> Package e2fsprogs.x86_64 0:1.41.12-23.el6 will be installed
--> Processing Dependency: libss = 1.41.12-23.el6 for package: e2fsprogs-1.41.12-23.el6.x86_64
--> Processing Dependency: e2fsprogs-libs = 1.41.12-23.el6 for package: e2fsprogs-1.41.12-23.el6.x86_64
--> Processing Dependency: libss.so.2()(64bit) for package: e2fsprogs-1.41.12-23.el6.x86_64
--> Processing Dependency: libext2fs.so.2()(64bit) for package: e2fsprogs-1.41.12-23.el6.x86_64
--> Processing Dependency: libe2p.so.2()(64bit) for package: e2fsprogs-1.41.12-23.el6.x86_64
---> Package python-configobj.noarch 0:4.6.0-3.el6 will be installed
---> Package python-contextlib2.noarch 0:0.5.1-1.el6 will be installed
---> Package python-coverage.x86_64 0:3.0.1-2.el6 will be installed
---> Package python-devel.x86_64 0:2.6.6-66.el6_8 will be installed
---> Package python-httpretty.noarch 0:0.8.14-2.20161011git70af1f8.el6 will be installed
--> Processing Dependency: python-urllib3 for package: python-httpretty-0.8.14-2.20161011git70af1f8.el6.noarch
---> Package python-jinja2.x86_64 0:2.2.1-3.el6 will be installed
--> Processing Dependency: python-babel >= 0.8 for package: python-jinja2-2.2.1-3.el6.x86_64
---> Package python-jsonpatch.noarch 0:1.2-4.el6 will be installed
--> Processing Dependency: python-jsonpointer for package: python-jsonpatch-1.2-4.el6.noarch
---> Package python-jsonschema.noarch 0:2.3.0-1.el6 will be installed
---> Package python-nose.noarch 0:0.10.4-3.1.el6 will be installed
---> Package python-oauthlib.noarch 0:0.6.0-4.el6 will be installed
--> Processing Dependency: python-crypto2.6 for package: python-oauthlib-0.6.0-4.el6.noarch
---> Package python-requests.noarch 0:2.6.0-4.el6 will be installed
--> Processing Dependency: python-chardet >= 2.2.1-1 for package: python-requests-2.6.0-4.el6.noarch
---> Package python-setuptools.noarch 0:0.6.10-3.el6 will be installed
---> Package python-six.noarch 0:1.9.0-2.el6 will be installed
---> Package python-tox.noarch 0:1.4.2-8.el6 will be installed
--> Processing Dependency: python-py for package: python-tox-1.4.2-8.el6.noarch
--> Processing Dependency: python-virtualenv for package: python-tox-1.4.2-8.el6.noarch
---> Package python-unittest2.noarch 0:0.5.1-3.el6 will be installed
---> Package python2-mock.noarch 0:1.0.1-10.el6 will be installed
---> Package rpm-build.x86_64 0:4.8.0-55.el6 will be installed
--> Processing Dependency: patch >= 2.5 for package: rpm-build-4.8.0-55.el6.x86_64
--> Processing Dependency: elfutils >= 0.128 for package: rpm-build-4.8.0-55.el6.x86_64
--> Processing Dependency: xz for package: rpm-build-4.8.0-55.el6.x86_64
--> Processing Dependency: unzip for package: rpm-build-4.8.0-55.el6.x86_64
--> Processing Dependency: system-rpm-config for package: rpm-build-4.8.0-55.el6.x86_64
--> Processing Dependency: lzma for package: rpm-build-4.8.0-55.el6.x86_64
--> Processing Dependency: file for package: rpm-build-4.8.0-55.el6.x86_64
--> Processing Dependency: bzip2 for package: rpm-build-4.8.0-55.el6.x86_64
--> Processing Dependency: /usr/bin/gdb-add-index for package: rpm-build-4.8.0-55.el6.x86_64
---> Package sudo.x86_64 0:1.8.6p3-29.el6_9 will be installed
--> Running transaction check
---> Package bzip2.x86_64 0:1.0.5-7.el6_0 will be installed
---> Package e2fsprogs-libs.x86_64 0:1.41.12-23.el6 will be installed
---> Package elfutils.x86_64 0:0.164-2.el6 will be installed
--> Processing Dependency: elfutils-libs(x86-64) = 0.164-2.el6 for package: elfutils-0.164-2.el6.x86_64
--> Processing Dependency: libdw.so.1(ELFUTILS_0.158)(64bit) for package: elfutils-0.164-2.el6.x86_64
--> Processing Dependency: libdw.so.1(ELFUTILS_0.149)(64bit) for package: elfutils-0.164-2.el6.x86_64
--> Processing Dependency: libdw.so.1(ELFUTILS_0.148)(64bit) for package: elfutils-0.164-2.el6.x86_64
--> Processing Dependency: libdw.so.1(ELFUTILS_0.138)(64bit) for package: elfutils-0.164-2.el6.x86_64
--> Processing Dependency: libdw.so.1(ELFUTILS_0.130)(64bit) for package: elfutils-0.164-2.el6.x86_64
--> Processing Dependency: libdw.so.1(ELFUTILS_0.127)(64bit) for package: elfutils-0.164-2.el6.x86_64
--> Processing Dependency: libdw.so.1(ELFUTILS_0.126)(64bit) for package: elfutils-0.164-2.el6.x86_64
--> Processing Dependency: libdw.so.1(ELFUTILS_0.122)(64bit) for package: elfutils-0.164-2.el6.x86_64
--> Processing Dependency: libasm.so.1(ELFUTILS_1.0)(64bit) for package: elfutils-0.164-2.el6.x86_64
--> Processing Dependency: libdw.so.1()(64bit) for package: elfutils-0.164-2.el6.x86_64
--> Processing Dependency: libasm.so.1()(64bit) for package: elfutils-0.164-2.el6.x86_64
---> Package file.x86_64 0:5.04-30.el6 will be installed
---> Package gdb.x86_64 0:7.2-92.el6 will be installed
---> Package libss.x86_64 0:1.41.12-23.el6 will be installed
---> Package libyaml.x86_64 0:0.1.3-4.el6_6 will be installed
---> Package patch.x86_64 0:2.6-6.el6 will be installed
---> Package python-babel.noarch 0:0.9.4-5.1.el6 will be installed
---> Package python-chardet.noarch 0:2.2.1-1.el6 will be installed
---> Package python-crypto2.6.x86_64 0:2.6.1-2.el6 will be installed
---> Package python-jsonpointer.noarch 0:1.0-4.el6 will be installed
---> Package python-py.noarch 0:1.4.18-1.el6.centos will be installed
---> Package python-urllib3.noarch 0:1.10.2-3.el6 will be installed
--> Processing Dependency: python-backports-ssl_match_hostname for package: python-urllib3-1.10.2-3.el6.noarch
---> Package python-virtualenv.noarch 0:1.10.1-1.el6 will be installed
---> Package redhat-rpm-config.noarch 0:9.0.3-51.el6.centos will be installed
---> Package unzip.x86_64 0:6.0-5.el6 will be installed
---> Package xz.x86_64 0:4.999.9-0.5.beta.20091007git.el6 will be installed
---> Package xz-lzma-compat.x86_64 0:4.999.9-0.5.beta.20091007git.el6 will be installed
--> Running transaction check
---> Package elfutils-libs.x86_64 0:0.164-2.el6 will be installed
---> Package python-backports-ssl_match_hostname.noarch 0:3.4.0.2-5.el6 will be installed
--> Processing Dependency: python-backports for package: python-backports-ssl_match_hostname-3.4.0.2-5.el6.noarch
--> Running transaction check
---> Package python-backports.x86_64 0:1.0-5.el6 will be installed
--> Finished Dependency Resolution

Dependencies Resolved

================================================================================
 Package                  Arch   Version                          Repository
                                                                           Size
================================================================================
Installing:
 PyYAML                   x86_64 3.10-3.1.el6                     base    157 k
 e2fsprogs                x86_64 1.41.12-23.el6                   base    554 k
 python-configobj         noarch 4.6.0-3.el6                      base    182 k
 python-contextlib2       noarch 0.5.1-1.el6                      epel     17 k
 python-coverage          x86_64 3.0.1-2.el6                      base     71 k
 python-devel             x86_64 2.6.6-66.el6_8                   base    173 k
 python-httpretty         noarch 0.8.14-2.20161011git70af1f8.el6  epel     44 k
 python-jinja2            x86_64 2.2.1-3.el6                      base    466 k
 python-jsonpatch         noarch 1.2-4.el6                        base     15 k
 python-jsonschema        noarch 2.3.0-1.el6                      epel     62 k
 python-nose              noarch 0.10.4-3.1.el6                   base    220 k
 python-oauthlib          noarch 0.6.0-4.el6                      epel    119 k
 python-requests          noarch 2.6.0-4.el6                      base     96 k
 python-setuptools        noarch 0.6.10-3.el6                     base    336 k
 python-six               noarch 1.9.0-2.el6                      base     28 k
 python-tox               noarch 1.4.2-8.el6                      epel     72 k
 python-unittest2         noarch 0.5.1-3.el6                      epel    138 k
 python2-mock             noarch 1.0.1-10.el6                     epel     93 k
 rpm-build                x86_64 4.8.0-55.el6                     base    131 k
 sudo                     x86_64 1.8.6p3-29.el6_9                 updates 711 k
Installing for dependencies:
 bzip2                    x86_64 1.0.5-7.el6_0                    base     49 k
 e2fsprogs-libs           x86_64 1.41.12-23.el6                   base    121 k
 elfutils                 x86_64 0.164-2.el6                      base    240 k
 elfutils-libs            x86_64 0.164-2.el6                      base    230 k
 file                     x86_64 5.04-30.el6                      base     49 k
 gdb                      x86_64 7.2-92.el6                       base    2.3 M
 libss                    x86_64 1.41.12-23.el6                   base     42 k
 libyaml                  x86_64 0.1.3-4.el6_6                    base     52 k
 patch                    x86_64 2.6-6.el6                        base     90 k
 python-babel             noarch 0.9.4-5.1.el6                    base    1.4 M
 python-backports         x86_64 1.0-5.el6                        base    5.5 k
 python-backports-ssl_match_hostname
                          noarch 3.4.0.2-5.el6                    base     12 k
 python-chardet           noarch 2.2.1-1.el6                      base    230 k
 python-crypto2.6         x86_64 2.6.1-2.el6                      epel    513 k
 python-jsonpointer       noarch 1.0-4.el6                        base    9.4 k
 python-py                noarch 1.4.18-1.el6.centos              extras  308 k
 python-urllib3           noarch 1.10.2-3.el6                     base    103 k
 python-virtualenv        noarch 1.10.1-1.el6                     epel    1.3 M
 redhat-rpm-config        noarch 9.0.3-51.el6.centos              base     60 k
 unzip                    x86_64 6.0-5.el6                        base    152 k
 xz                       x86_64 4.999.9-0.5.beta.20091007git.el6 base    137 k
 xz-lzma-compat           x86_64 4.999.9-0.5.beta.20091007git.el6 base     16 k

Transaction Summary
================================================================================
Install      42 Package(s)

Total size: 11 M
Installed size: 34 M
Downloading Packages:
warning: rpmts_HdrFromFdno: Header V3 RSA/SHA256 Signature, key ID 0608b895: NOKEY
Retrieving key from file:///etc/pki/rpm-gpg/RPM-GPG-KEY-EPEL-6
Importing GPG key 0x0608B895:
 Userid : EPEL (6) <epel@fedoraproject.org>
 Package: epel-release-6-8.noarch (@extras)
 From   : /etc/pki/rpm-gpg/RPM-GPG-KEY-EPEL-6
Running rpm_check_debug
Running Transaction Test
Transaction Test Succeeded
Running Transaction

  Installing : python-setuptools-0.6.10-3.el6.noarch                       1/42 

  Installing : xz-4.999.9-0.5.beta.20091007git.el6.x86_64                  2/42 

  Installing : xz-lzma-compat-4.999.9-0.5.beta.20091007git.el6.x86_64      3/42 

  Installing : python-py-1.4.18-1.el6.centos.noarch                        4/42 

  Installing : bzip2-1.0.5-7.el6_0.x86_64                                  5/42 

  Installing : file-5.04-30.el6.x86_64                                     6/42 

  Installing : patch-2.6-6.el6.x86_64                                      7/42 

  Installing : libss-1.41.12-23.el6.x86_64                                 8/42 

  Installing : elfutils-libs-0.164-2.el6.x86_64                            9/42 

  Installing : elfutils-0.164-2.el6.x86_64                                10/42 

  Installing : python-babel-0.9.4-5.1.el6.noarch                          11/42 

  Installing : unzip-6.0-5.el6.x86_64                                     12/42 

  Installing : redhat-rpm-config-9.0.3-51.el6.centos.noarch               13/42 

  Installing : python-chardet-2.2.1-1.el6.noarch                          14/42 

  Installing : python-backports-1.0-5.el6.x86_64                          15/42 

  Installing : python-backports-ssl_match_hostname-3.4.0.2-5.el6.noarch   16/42 

  Installing : e2fsprogs-libs-1.41.12-23.el6.x86_64                       17/42 

  Installing : python-crypto2.6-2.6.1-2.el6.x86_64                        18/42 

  Installing : python-devel-2.6.6-66.el6_8.x86_64                         19/42 

  Installing : python-virtualenv-1.10.1-1.el6.noarch                      20/42 

  Installing : libyaml-0.1.3-4.el6_6.x86_64                               21/42 

  Installing : gdb-7.2-92.el6.x86_64                                      22/42 

  Installing : python-six-1.9.0-2.el6.noarch                              23/42 

  Installing : python-urllib3-1.10.2-3.el6.noarch                         24/42 

  Installing : python-jsonpointer-1.0-4.el6.noarch                        25/42 

  Installing : python-jsonpatch-1.2-4.el6.noarch                          26/42 

  Installing : python-httpretty-0.8.14-2.20161011git70af1f8.el6.noarch    27/42 

  Installing : python-requests-2.6.0-4.el6.noarch                         28/42 

  Installing : rpm-build-4.8.0-55.el6.x86_64                              29/42 

  Installing : PyYAML-3.10-3.1.el6.x86_64                                 30/42 

  Installing : python-tox-1.4.2-8.el6.noarch                              31/42 

  Installing : python-oauthlib-0.6.0-4.el6.noarch                         32/42 

  Installing : e2fsprogs-1.41.12-23.el6.x86_64                            33/42 

  Installing : python-jinja2-2.2.1-3.el6.x86_64                           34/42 

  Installing : python-coverage-3.0.1-2.el6.x86_64                         35/42 

  Installing : python-nose-0.10.4-3.1.el6.noarch                          36/42 

  Installing : python-unittest2-0.5.1-3.el6.noarch                        37/42 

  Installing : python-contextlib2-0.5.1-1.el6.noarch                      38/42 

  Installing : python-configobj-4.6.0-3.el6.noarch                        39/42 

  Installing : python-jsonschema-2.3.0-1.el6.noarch                       40/42 

  Installing : python2-mock-1.0.1-10.el6.noarch                           41/42 

  Installing : sudo-1.8.6p3-29.el6_9.x86_64                               42/42 

  Verifying  : python-jsonpointer-1.0-4.el6.noarch                         1/42 

  Verifying  : python-six-1.9.0-2.el6.noarch                               2/42 

  Verifying  : gdb-7.2-92.el6.x86_64                                       3/42 

  Verifying  : libyaml-0.1.3-4.el6_6.x86_64                                4/42 

  Verifying  : python-devel-2.6.6-66.el6_8.x86_64                          5/42 

  Verifying  : python-jsonpatch-1.2-4.el6.noarch                           6/42 

  Verifying  : python-oauthlib-0.6.0-4.el6.noarch                          7/42 

  Verifying  : sudo-1.8.6p3-29.el6_9.x86_64                                8/42 

  Verifying  : xz-4.999.9-0.5.beta.20091007git.el6.x86_64                  9/42 

  Verifying  : python-crypto2.6-2.6.1-2.el6.x86_64                        10/42 

  Verifying  : e2fsprogs-libs-1.41.12-23.el6.x86_64                       11/42 

  Verifying  : python-backports-1.0-5.el6.x86_64                          12/42 

  Verifying  : PyYAML-3.10-3.1.el6.x86_64                                 13/42 

  Verifying  : python2-mock-1.0.1-10.el6.noarch                           14/42 

  Verifying  : python-chardet-2.2.1-1.el6.noarch                          15/42 

  Verifying  : python-coverage-3.0.1-2.el6.x86_64                         16/42 

  Verifying  : e2fsprogs-1.41.12-23.el6.x86_64                            17/42 

  Verifying  : redhat-rpm-config-9.0.3-51.el6.centos.noarch               18/42 

  Verifying  : python-tox-1.4.2-8.el6.noarch                              19/42 

  Verifying  : python-nose-0.10.4-3.1.el6.noarch                          20/42 

  Verifying  : unzip-6.0-5.el6.x86_64                                     21/42 

  Verifying  : python-httpretty-0.8.14-2.20161011git70af1f8.el6.noarch    22/42 

  Verifying  : python-babel-0.9.4-5.1.el6.noarch                          23/42 

  Verifying  : python-py-1.4.18-1.el6.centos.noarch                       24/42 

  Verifying  : rpm-build-4.8.0-55.el6.x86_64                              25/42 

  Verifying  : xz-lzma-compat-4.999.9-0.5.beta.20091007git.el6.x86_64     26/42 

  Verifying  : python-jsonschema-2.3.0-1.el6.noarch                       27/42 

  Verifying  : python-urllib3-1.10.2-3.el6.noarch                         28/42 

  Verifying  : elfutils-libs-0.164-2.el6.x86_64                           29/42 

  Verifying  : python-setuptools-0.6.10-3.el6.noarch                      30/42 

  Verifying  : libss-1.41.12-23.el6.x86_64                                31/42 

  Verifying  : python-jinja2-2.2.1-3.el6.x86_64                           32/42 

  Verifying  : python-configobj-4.6.0-3.el6.noarch                        33/42 

  Verifying  : python-contextlib2-0.5.1-1.el6.noarch                      34/42 

  Verifying  : patch-2.6-6.el6.x86_64                                     35/42 

  Verifying  : file-5.04-30.el6.x86_64                                    36/42 

  Verifying  : python-virtualenv-1.10.1-1.el6.noarch                      37/42 

  Verifying  : elfutils-0.164-2.el6.x86_64                                38/42 

  Verifying  : python-requests-2.6.0-4.el6.noarch                         39/42 

  Verifying  : python-backports-ssl_match_hostname-3.4.0.2-5.el6.noarch   40/42 

  Verifying  : python-unittest2-0.5.1-3.el6.noarch                        41/42 

  Verifying  : bzip2-1.0.5-7.el6_0.x86_64                                 42/42 

Installed:
  PyYAML.x86_64 0:3.10-3.1.el6                                                  
  e2fsprogs.x86_64 0:1.41.12-23.el6                                             
  python-configobj.noarch 0:4.6.0-3.el6                                         
  python-contextlib2.noarch 0:0.5.1-1.el6                                       
  python-coverage.x86_64 0:3.0.1-2.el6                                          
  python-devel.x86_64 0:2.6.6-66.el6_8                                          
  python-httpretty.noarch 0:0.8.14-2.20161011git70af1f8.el6                     
  python-jinja2.x86_64 0:2.2.1-3.el6                                            
  python-jsonpatch.noarch 0:1.2-4.el6                                           
  python-jsonschema.noarch 0:2.3.0-1.el6                                        
  python-nose.noarch 0:0.10.4-3.1.el6                                           
  python-oauthlib.noarch 0:0.6.0-4.el6                                          
  python-requests.noarch 0:2.6.0-4.el6                                          
  python-setuptools.noarch 0:0.6.10-3.el6                                       
  python-six.noarch 0:1.9.0-2.el6                                               
  python-tox.noarch 0:1.4.2-8.el6                                               
  python-unittest2.noarch 0:0.5.1-3.el6                                         
  python2-mock.noarch 0:1.0.1-10.el6                                            
  rpm-build.x86_64 0:4.8.0-55.el6                                               
  sudo.x86_64 0:1.8.6p3-29.el6_9                                                

Dependency Installed:
  bzip2.x86_64 0:1.0.5-7.el6_0                                                  
  e2fsprogs-libs.x86_64 0:1.41.12-23.el6                                        
  elfutils.x86_64 0:0.164-2.el6                                                 
  elfutils-libs.x86_64 0:0.164-2.el6                                            
  file.x86_64 0:5.04-30.el6                                                     
  gdb.x86_64 0:7.2-92.el6                                                       
  libss.x86_64 0:1.41.12-23.el6                                                 
  libyaml.x86_64 0:0.1.3-4.el6_6                                                
  patch.x86_64 0:2.6-6.el6                                                      
  python-babel.noarch 0:0.9.4-5.1.el6                                           
  python-backports.x86_64 0:1.0-5.el6                                           
  python-backports-ssl_match_hostname.noarch 0:3.4.0.2-5.el6                    
  python-chardet.noarch 0:2.2.1-1.el6                                           
  python-crypto2.6.x86_64 0:2.6.1-2.el6                                         
  python-jsonpointer.noarch 0:1.0-4.el6                                         
  python-py.noarch 0:1.4.18-1.el6.centos                                        
  python-urllib3.noarch 0:1.10.2-3.el6                                          
  python-virtualenv.noarch 0:1.10.1-1.el6                                       
  redhat-rpm-config.noarch 0:9.0.3-51.el6.centos                                
  unzip.x86_64 0:6.0-5.el6                                                      
  xz.x86_64 0:4.999.9-0.5.beta.20091007git.el6                                  
  xz-lzma-compat.x86_64 0:4.999.9-0.5.beta.20091007git.el6                      

Complete!
Installing deps: python-configobj python-oauthlib python-contextlib2 python-coverage python-httpretty python-six PyYAML python-jsonpatch python-jinja2 python-jsonschema python-setuptools python-requests python-unittest2 python-mock python-nose e2fsprogs iproute net-tools procps rsyslog shadow-utils sudo python-devel python-setuptools make sudo tar python-tox
# On branch cloud-test-add-pylint-and-fix
# Untracked files:
#   (use "git add <file>..." to include in what will be committed)
#
#	cloud-init.dsc
#	cloud-init_17.1-53-gca2ce2ec-1~bddeb.debian.tar.xz
#	cloud-init_17.1-53-gca2ce2ec-1~bddeb.dsc
#	cloud-init_17.1-53-gca2ce2ec-1~bddeb_all.deb
#	cloud-init_17.1-53-gca2ce2ec-1~bddeb_amd64.changes
#	cloud-init_17.1-53-gca2ce2ec-1~bddeb_source.build
#	cloud-init_17.1-53-gca2ce2ec-1~bddeb_source.changes
#	cloud-init_17.1-53-gca2ce2ec.orig.tar.gz
nothing added to commit but untracked files present (use "git add" to track)
..................................../usr/lib/python2.6/site-packages/unittest2/case.py:335: DeprecationWarning: Use of a TestResult without an addSkip method is deprecated
  self._addSkip(result, str(e))
...................................................................................................................................................................................................................................................................................................................................................................................................................................................................................................................................................................................................................................................................................................................................................................................................................................................................................................................................................E..................................................................................................................................E...........................
======================================================================
ERROR: test_base_reporting_handler_is_abstract (tests.unittests.test_reporting.TestBaseReportingHandler)
----------------------------------------------------------------------
Traceback (most recent call last):
  File "/home/ci-test/cloud-init/tests/unittests/test_reporting.py", line 129, in test_base_reporting_handler_is_abstract
    self.assertRaisesRegex(TypeError, regexp, handlers.ReportingHandler)
AttributeError: 'TestBaseReportingHandler' object has no attribute 'assertRaisesRegex'

======================================================================
ERROR: Warn on no #! in script
----------------------------------------------------------------------
Traceback (most recent call last):
  File "/home/ci-test/cloud-init/tests/unittests/test_util.py", line 698, in test_subp_warn_missing_shebang
    self.assertRaisesRegex(util.ProcessExecutionError,
AttributeError: 'TestSubp' object has no attribute 'assertRaisesRegex'

----------------------------------------------------------------------
Ran 1110 tests in 7.805s

FAILED (errors=2)
nosetests failed. ret=1
Archived the code in u'/tmp/rpmbuildpQRQhw/rpmbuild/SOURCES/cloud-init-17.1-53-gca2ce2ec.tar.gz'
Created spec file at '/tmp/rpmbuildpQRQhw/rpmbuild/SPECS/cloud-init.spec'
Running 'rpmbuild' in '/tmp/rpmbuildpQRQhw/rpmbuild'
Wrote out redhat package '/home/ci-test/cloud-init/cloud-init-17.1+53.gca2ce2ec-1.el6.noarch.rpm'
Wrote out redhat package '/home/ci-test/cloud-init/cloud-init-17.1+53.gca2ce2ec-1.el6.src.rpm'
there were 1 errors.
[Pipeline] }
[Pipeline] // stage
[Pipeline] stage
[Pipeline] { (Declarative: Post Actions)
[Pipeline] build (Building admin-lp-vote-git)
Scheduling project: admin-lp-vote-git
Starting building: admin-lp-vote-git #1283
[Pipeline] }
[Pipeline] // stage
[Pipeline] }
[Pipeline] // node
[Pipeline] End of Pipeline
ERROR: script returned exit code 1
Finished: FAILURE