FailedConsole Output

Started by upstream project "cloud-init-integration-lxd-a" build number 319
originally caused by:
 Started by upstream project "cloud-init-integration-lxd-x" build number 509
 originally caused by:
  Started by timer
Building remotely on torkoal (metal-amd64) in workspace /var/lib/jenkins/slaves/torkoal/workspace/cloud-init-integration-lxd-b
[cloud-init-integration-lxd-b] $ /bin/sh -xe /tmp/jenkins8577191531144830449.sh
+ release=bionic
+ export http_proxy=http://squid.internal:3128
+ export apt_proxy=http://squid.internal:3128
+ sudo rm -Rf cloud-init
+ git clone https://git.launchpad.net/cloud-init
Cloning into 'cloud-init'...
+ cd cloud-init
+ ./packages/bddeb -S
Creating a temporary tarball using the 'make-tarball' helper
Extracting temporary tarball 'cloud-init_18.2-9-g49b562c9.orig.tar.gz'
Creating a debian/ folder in '/tmp/tmp3pkylg6e/cloud-init-18.2-9-g49b562c9'
Running 'debuild -S -us -uc' in '/tmp/tmp3pkylg6e/cloud-init-18.2-9-g49b562c9'
Traceback (most recent call last):
  File "./packages/bddeb", line 207, in <module>
    sys.exit(main())
  File "./packages/bddeb", line 181, in main
    util.subp(cmd, capture=capture)
  File "/var/lib/jenkins/slaves/torkoal/workspace/cloud-init-integration-lxd-b/cloud-init/cloudinit/util.py", line 1957, in subp
    cmd=args)
cloudinit.util.ProcessExecutionError: Unexpected error while running command.
Command: ['debuild', '--preserve-envvar', 'INIT_SYSTEM', '-S', '-us', '-uc']
Exit code: 29
Reason: -
Stdout:  dpkg-buildpackage -rfakeroot -d -us -uc -S
        dpkg-buildpackage: source package cloud-init
        dpkg-buildpackage: source version 18.2-9-g49b562c9-1~bddeb
        dpkg-buildpackage: source distribution UNRELEASED
        dpkg-buildpackage: source changed by Scott Moser <smoser@ubuntu.com>
         dpkg-source --before-build cloud-init-18.2-9-g49b562c9
         fakeroot debian/rules clean
        dh clean --with python3,systemd --buildsystem pybuild
           dh_testdir -O--buildsystem=pybuild
           dh_auto_clean -O--buildsystem=pybuild
        semop(1): encountered an error: Invalid argument
        debian/rules:7: recipe for target 'clean' failed
        make: *** [clean] Error 1
        /usr/bin/fakeroot: line 1: kill: (20715) - No such process
        dpkg-buildpackage: error: fakeroot debian/rules clean gave error exit status 2
Stderr: debuild: fatal error at line 1376:
        dpkg-buildpackage -rfakeroot -d -us -uc -S failed
Build step 'Execute shell' marked build as failure
Sending e-mails to: server-crew-qa@lists.canonical.com
Archiving artifacts
Started calculate disk usage of build
Finished Calculation of disk usage of build in 0 seconds
Started calculate disk usage of workspace
Finished Calculation of disk usage of workspace in 0 seconds
Finished: FAILURE